program: Orca
programVersion: 5.0.2
elementType: F F O O O O N C C C C C C C C C C C C C C C C C C C C C C C C C C H H H H H H H H H H H H H H H H H H H H H H H
charge: 0
multiplicity: 1
keywords: wb97x-d3
keywords: def2-TZVPP
keywords: def2/J RIJCOSX
keywords: DEFGRID2
keywords: scfconv7
keywords: smallprint printgap noloewdin
keywords: NOSOSCF
formula: C26H23F2NO4
InChI: InChI=1/C26H23F2NO4/c1-17(2)24(18-11-13-21(14-12-18)32-26(27)28)25(30)33-23(16-29)19-7-6-10-22(15-19)31-20-8-4-3-5-9-20/h3-15,17,23-24,26H,1-2H3
56 atoms
F  -3.58426 -1.711836 2.0227
F  -3.482389 -3.431016 3.331226
O  3.148258 0.560417 0.001423
O  2.028499 0.499769 -1.935963
O  -1.622152 -2.500547 2.731025
O  -2.10251 2.851154 -0.129837
N  4.378972 2.904965 1.968649
C  2.671484 -1.570237 -0.861748
C  2.644317 -2.350129 -2.181893
C  1.511228 -1.877724 0.067245
C  3.835138 -1.983559 -3.062267
C  2.633795 -3.849388 -1.903953
C  2.592209 -0.0706 -1.046007
C  1.723376 -2.312655 1.370532
C  0.202092 -1.65645 -0.342598
C  2.696947 1.891674 0.246538
C  0.663854 -2.536719 2.23254
C  -0.870694 -1.85043 0.512908
C  -0.634507 -2.298848 1.805332
C  1.289376 1.852609 0.791087
C  0.251013 2.415957 0.068201
C  1.032466 1.16976 1.975769
C  -1.053911 2.281276 0.528838
C  3.643943 2.451088 1.21208
C  -0.26875 1.049183 2.426641
C  -1.318619 1.592938 1.700832
C  -2.871629 -2.825198 2.309971
C  -2.358367 2.542846 -1.432711
C  -3.252368 3.379968 -2.0905
C  -1.809203 1.449869 -2.091096
C  -3.597633 3.117992 -3.40469
C  -2.160598 1.206305 -3.411782
C  -3.053048 2.031388 -4.075653
H  3.60236 -1.807199 -0.335519
H  1.728462 -2.090377 -2.721176
H  3.823307 -2.566289 -3.983805
H  4.779101 -2.197677 -2.555543
H  3.834096 -0.932263 -3.346929
H  3.531119 -4.154503 -1.360316
H  1.769321 -4.155577 -1.315598
H  2.613887 -4.410921 -2.838214
H  2.733665 -2.483262 1.72151
H  0.003707 -1.299221 -1.34544
H  2.740587 2.495897 -0.66498
H  0.838834 -2.88559 3.24185
H  -1.865266 -1.603757 0.167368
H  0.448928 2.938642 -0.85961
H  1.843572 0.729792 2.541483
H  -0.474814 0.513552 3.343136
H  -2.340045 1.488738 2.041821
H  -2.877099 -3.477415 1.429859
H  -3.672693 4.226776 -1.564264
H  -1.104889 0.796567 -1.594384
H  -4.295433 3.773031 -3.909344
H  -1.723992 0.358096 -3.922557
H  -3.320854 1.832841 -5.104346
totalener: -1560.09026264 hartree
nucrepener: 3461.75864441 hartree
electener: -5021.84890705 hartree
oneelecener: -9013.84580921 hartree
twoeener: 3991.99690215 hartree
kineticenergy: 1553.71336263 hartree
xcener: -146.828183085279 hartree
chargesum: -0.0000000
charge: -0.189188 -0.174606 -0.255614 -0.345740 -0.258496 -0.297708 0.001973 0.075424 0.048712 -0.024603 -0.277121 -0.280352 0.278463 -0.120426 -0.203718 0.319531 -0.172869 -0.132287 0.211721 0.088332 -0.193684 -0.235146 0.269584 -0.264333 -0.060639 -0.219242 0.373255 0.259304 -0.204017 -0.106044 -0.099070 -0.156832 -0.131346 0.087993 0.045772 0.085031 0.083048 0.103313 0.080001 0.098334 0.091622 0.111528 0.131894 0.119918 0.130852 0.134575 0.126728 0.121819 0.135660 0.131355 0.088601 0.124794 0.074619 0.124663 0.120787 0.123876
qa: -0.1892 -0.1746 -0.2556 -0.3457 -0.2585 -0.2977 0.0020 0.0754 0.0487 -0.0246 -0.2771 -0.2804 0.2785 -0.1204 -0.2037 0.3195 -0.1729 -0.1323 0.2117 0.0883 -0.1937 -0.2351 0.2696 -0.2643 -0.0606 -0.2192 0.3733 0.2593 -0.2040 -0.1060 -0.0991 -0.1568 -0.1313 0.0880 0.0458 0.0850 0.0830 0.1033 0.0800 0.0983 0.0916 0.1115 0.1319 0.1199 0.1309 0.1346 0.1267 0.1218 0.1357 0.1314 0.0886 0.1248 0.0746 0.1247 0.1208 0.1239
va: 1.0768 1.1130 2.1518 2.1431 2.0738 2.1192 3.1188 3.7470 3.8313 3.5556 3.9262 3.9444 4.3089 3.9690 4.0455 3.8363 4.0050 3.8435 3.8483 3.5359 3.9988 4.0149 3.8109 4.0378 3.8639 4.0400 4.2996 3.8208 4.0072 3.8759 3.9577 4.0037 3.9535 1.0376 1.0237 1.0071 1.0040 1.0144 1.0052 1.0039 1.0075 1.0096 1.0079 1.0185 1.0100 1.0202 1.0140 1.0189 0.9974 1.0144 0.9847 1.0155 1.0188 0.9988 1.0022 1.0006
dispcorr: -0.036246453 hartree
energy: -1560.126509096966
dipole: 17.86872 -18.15734 -0.28861 -8.72945 7.27507 -1.45437 -27.02085 25.88968 -1.13117
magnitude: 1.86495 au
magnitude: 4.74033 debye
