program: Orca
programVersion: 5.0.2
elementType: F F O O O O N C C C C C C C C C C C C C C C C C C C C C C C C C C H H H H H H H H H H H H H H H H H H H H H H H
charge: 0
multiplicity: 1
keywords: wb97x-d3
keywords: def2-TZVPP
keywords: def2/J RIJCOSX
keywords: DEFGRID2
keywords: scfconv7
keywords: smallprint printgap noloewdin
keywords: NOSOSCF
formula: C26H23F2NO4
InChI: InChI=1/C26H23F2NO4/c1-17(2)24(18-11-13-21(14-12-18)32-26(27)28)25(30)33-23(16-29)19-7-6-10-22(15-19)31-20-8-4-3-5-9-20/h3-15,17,23-24,26H,1-2H3
56 atoms
F  -3.587075 -1.731009 2.022708
F  -3.476623 -3.451478 3.328472
O  3.140948 0.562571 -0.006751
O  2.015465 0.503022 -1.940691
O  -1.62048 -2.512225 2.727181
O  -2.114726 2.841511 -0.125651
N  4.372866 2.905959 1.961442
C  2.664934 -1.567467 -0.871362
C  2.637222 -2.345265 -2.192704
C  1.506717 -1.878385 0.05897
C  3.825914 -1.974326 -3.074255
C  2.630892 -3.845008 -1.917208
C  2.583194 -0.067775 -1.053527
C  1.722104 -2.316564 1.360434
C  0.196632 -1.658336 -0.347858
C  2.688027 1.892683 0.242176
C  0.664744 -2.544127 2.224141
C  -0.874049 -1.85594 0.509251
C  -0.634788 -2.307005 1.80021
C  1.281594 1.850396 0.789034
C  0.241267 2.412257 0.067604
C  1.027849 1.165486 1.973161
C  -1.062981 2.273878 0.529364
C  3.636837 2.452557 1.205644
C  -0.272523 1.041602 2.42542
C  -1.324497 1.583843 1.701452
C  -2.869123 -2.841746 2.307277
C  -2.360059 2.555524 -1.435618
C  -3.247668 3.404736 -2.086397
C  -1.8079 1.471951 -2.107083
C  -3.583504 3.164519 -3.407267
C  -2.149542 1.250416 -3.434202
C  -3.035677 2.087789 -4.091303
H  3.597114 -1.80354 -0.34704
H  1.719935 -2.086764 -2.730102
H  4.771311 -2.186366 -2.569087
H  3.821578 -0.922595 -3.35744
H  3.814475 -2.55594 -3.996665
H  2.611299 -4.405223 -2.852574
H  3.529937 -4.148698 -1.375199
H  1.767763 -4.154255 -1.32803
H  2.733315 -2.487094 1.708738
H  -0.004352 -1.299039 -1.349187
H  2.728932 2.498676 -0.668344
H  0.842308 -2.895527 3.232071
H  -1.869682 -1.609944 0.166374
H  0.437509 2.93656 -0.859793
H  1.840505 0.726305 2.53713
H  -0.4764 0.504417 3.341605
H  -2.345421 1.477021 2.043638
H  -2.87332 -3.492738 1.425952
H  -3.670528 4.243759 -1.549698
H  -1.108708 0.809219 -1.615469
H  -4.276464 3.828782 -3.906527
H  -1.710672 0.409681 -3.955208
H  -3.296194 1.906215 -5.124983
totalener: -1560.09028726 hartree
nucrepener: 3460.60361914 hartree
electener: -5020.69390640 hartree
oneelecener: -9011.54200003 hartree
twoeener: 3990.84809363 hartree
kineticenergy: 1553.71091971 hartree
xcener: -146.827685002892 hartree
chargesum: -0.0000000
charge: -0.189245 -0.174701 -0.255567 -0.346109 -0.258454 -0.297453 0.002024 0.075698 0.049054 -0.023948 -0.277196 -0.280486 0.278652 -0.121095 -0.203869 0.319237 -0.171993 -0.131683 0.210597 0.089757 -0.195480 -0.236387 0.271646 -0.264248 -0.059596 -0.221403 0.373197 0.260626 -0.205320 -0.108151 -0.098471 -0.155933 -0.131960 0.087942 0.045806 0.083084 0.103290 0.085017 0.091611 0.079956 0.098354 0.111430 0.131556 0.119747 0.130889 0.134466 0.126713 0.121699 0.135673 0.131418 0.088645 0.124901 0.075931 0.125053 0.121145 0.123933
qa: -0.1892 -0.1747 -0.2556 -0.3461 -0.2585 -0.2975 0.0020 0.0757 0.0491 -0.0239 -0.2772 -0.2805 0.2787 -0.1211 -0.2039 0.3192 -0.1720 -0.1317 0.2106 0.0898 -0.1955 -0.2364 0.2716 -0.2642 -0.0596 -0.2214 0.3732 0.2606 -0.2053 -0.1082 -0.0985 -0.1559 -0.1320 0.0879 0.0458 0.0831 0.1033 0.0850 0.0916 0.0800 0.0984 0.1114 0.1316 0.1197 0.1309 0.1345 0.1267 0.1217 0.1357 0.1314 0.0886 0.1249 0.0759 0.1251 0.1211 0.1239
va: 1.0768 1.1129 2.1519 2.1427 2.0736 2.1197 3.1187 3.7465 3.8306 3.5546 3.9261 3.9445 4.3088 3.9701 4.0453 3.8370 4.0047 3.8434 3.8490 3.5353 3.9978 4.0162 3.8095 4.0376 3.8635 4.0396 4.2995 3.8178 4.0087 3.8783 3.9566 4.0030 3.9540 1.0377 1.0238 1.0040 1.0144 1.0071 1.0075 1.0052 1.0039 1.0096 1.0085 1.0185 1.0100 1.0201 1.0140 1.0190 0.9974 1.0145 0.9847 1.0155 1.0185 0.9987 1.0021 1.0006
dispcorr: -0.036209554 hartree
energy: -1560.126496811218
dipole: 17.88982 -18.17636 -0.28654 -8.54938 7.10314 -1.44623 -27.08862 25.94812 -1.14049
magnitude: 1.86398 au
magnitude: 4.73786 debye
