program: Gaussian 09
title: 000007757
version: EM64L-G09RevD.01
frameworkgroup: C1[X(C5H8O3)]
method: RPBEPBE
basis: SDD
operation: Freq
keyword: #p
keyword: freq=noraman
keyword: PBEPBE/SDD
title: #p freq=noraman PBEPBE/SDD
converged: YES YES NO NO
title: Mulliken charges:
elementType: O O O C C C C C H H H H H H H H
charge: -0.256331 -0.190208 -0.231618 -0.574544 0.242662 0.278407 -0.753029 -0.498744 0.262706 0.249858 0.261810 0.235742 0.248143 0.233173 0.251657 0.240316
chargesum: 0.00000
title: Mulliken charges with hydrogens summed into heavy atoms:
elementType: O O O C C C C C
charge: -0.256331 -0.190208 -0.231618 -0.061980 0.242662 0.278407 -0.007334 0.226401
polarizability: 7.63101937e+01 -5.09057404e+00 5.74312488e+01 2.03861330e+00 -7.53625908e-01 5.32421629e+01
1716.lowfreq: -10.0514 -4.8363 0.0004 0.0008 0.0009 1.6408 38.0873 49.8141 89.5234
frequency: 37.9198 49.8080 89.5159 105.5693 112.7525 209.8296 252.7425 315.0318 384.5120 457.1703 515.7894 595.4729 705.1888 783.5097 827.3612 867.5321 950.8003 989.4906 1021.7924 1112.9161 1137.6686 1151.3801 1164.2688 1245.8809 1285.3632 1371.2744 1417.0599 1425.1634 1443.6180 1452.6550 1456.1289 1463.1670 1640.2185 1661.4217 2982.8763 3007.3580 3013.4521 3068.7783 3081.5897 3110.9221 3124.8313 3152.6504
redmass: 3.2963 5.2458 1.2045 1.5404 1.6298 5.3693 3.1593 3.2232 2.4066 2.6380 5.1784 4.8303 5.5401 2.9676 3.7449 1.9316 2.9088 2.7407 1.9721 1.2703 1.9529 1.4391 2.2977 2.0665 1.7643 1.2315 1.1228 1.1845 1.0635 1.0495 1.0581 1.0506 8.3502 9.1458 1.0379 1.0294 1.0598 1.0956 1.1004 1.1047 1.1004 1.1050
irintensity: 2.7004 5.4078 1.1399 0.7297 1.5874 4.4127 16.5890 2.9547 3.7789 0.9556 13.9533 9.2781 2.6461 12.9976 6.1756 1.4842 24.2083 10.9991 14.3041 0.0742 136.1411 9.7403 76.6823 130.4710 153.2687 55.4300 14.1002 40.6274 24.4084 14.7749 20.2464 10.2931 161.6537 149.7074 2.2205 27.8442 7.3417 10.3025 3.9278 23.3114 10.7284 15.5773
temp: 298.150 k
press: 1.00000 atm
elementType: 8 8 8 6 6 6 6 6 1 1 1 1 1 1 1 1
symmnumber: 1
zpe: 324441.8 jmol-1
zpe.correction: 0.123573 hartree
zpe.thermalcorrener: 0.133283 hartree
zpe.thermalcorrenthalpy: 0.134227 hartree
zpe.thermalcorrgfe: 0.087341 hartree
zpe.sumelectzpe: -420.361570 hartree
zpe.sumelectthermal: -420.351861 hartree
zpe.sumelectthermalent: -420.350917 hartree
zpe.sumelectthermalfe: -420.397803 hartree
dipole: -0.9427 0.8252 -2.8933
dipole: 3.1529
quadrupole: -34.4338 -50.8715 -50.3566
quadrupole: -6.9433 1.1286 -1.4590
quadrupole: 10.7868 -5.6509 -5.1359 -6.9433 1.1286 -1.4590
hfenergy: -420.4851437 hartree
pointgroup: C01 [X(C5H8O3)]
dipole: 0.2752281 1.1856584 0.239188 debye
dipolederiv: -1.0705355 -0.0968009 0.3974107 -0.1310949 -0.3491084 -0.0899669 0.5082265 -0.0602456 -0.7765231 -0.567207 -0.0904156 0.0015622 0.0071831 -0.7361516 0.2430199 -0.0536241 0.2163369 -0.3874458 -0.5803237 -0.1111331 -0.1298447 -0.0757166 -0.3993582 -0.3218563 0.1443048 -0.1390699 -0.8627217 -0.6453066 0.0802451 -0.2080153 0.2108019 -0.1983907 0.1368218 -0.221528 0.0754372 -0.0212579 1.233503 0.0273002 0.1317171 -0.2426639 0.8339946 -0.430523 0.2461487 -0.3696403 0.3188191 1.3229976 0.2055913 -0.1866222 0.2642606 0.3402444 0.4826588 -0.5689546 0.2827662 1.3052241 -0.5347967 -0.151609 0.0206217 -0.0774027 -0.0308789 0.0505609 0.0444944 0.0669348 -0.0079162 0.5630955 0.0637286 -0.1115055 0.1169648 0.284865 -0.0698513 -0.0409708 -0.0355029 0.255077 0.0967118 0.0169739 -0.0134066 -0.0310298 0.0353609 -0.0701014 -0.0086953 -0.0865513 0.0469732 0.0202655 -0.0326979 0.0562857 -0.0699088 0.0971153 0.0148041 0.050488 0.0700707 -0.0053199 0.0006619 0.0264255 -0.0652694 0.055425 0.0523793 0.0809519 -0.09787 0.0574332 0.0440918 0.091045 0.0318494 0.0152016 -0.0069821 -0.1021972 -0.0463653 -0.0306907 -0.0519554 0.1172649 0.0848089 -0.0163917 0.0202004 0.0038435 0.1205891 -0.0287846 0.0511694 -0.0274524 -0.0599576 0.0213237 -0.0055452 0.0754889 0.0080316 0.1013386 -0.0502443 0.1206449 -0.032498 -0.0534793 0.0078187 0.0517283 0.0229486 -0.0342232 -0.0997256 0.018009 -0.0127127 -0.0312319 0.1065331 -0.044062 0.0007513 -0.0267732 0.0025114 0.0499236 0.0808666 -0.1304303 0.0651688 -0.019362 unknown
polarizability: 76.0816002|5.6627914|55.3212688|-1.9786006|-1.9445474|55.5807364 unknown
InChI: InChI=1S/C5H8O3/c1-4(6)3-5(7)8-2/h3H2,1-2H3
charge 0 multiplicity 1
16 atoms
O  -1.750307 0.542108 0.449289
O  1.14662 -0.984757 0.738601
O  -1.199662 -0.225845 -1.682471
C  0.428751 1.083509 -0.373108
C  1.469323 0.123389 0.248305
C  -0.899085 0.401249 -0.643242
C  2.908824 0.61888 0.215253
C  -3.03953 -0.186061 0.353643
H  0.288457 1.925418 0.330416
H  0.831474 1.489931 -1.317661
H  3.52731 0.037014 0.915898
H  2.974862 1.695687 0.454091
H  3.31503 0.485112 -0.80662
H  -3.553621 0.028461 1.300555
H  -2.85159 -1.266111 0.236975
H  -3.621157 0.178816 -0.509624
