program: Gaussian 09
title: 000067477
version: EM64L-G09RevD.01
frameworkgroup: C1[X(C10H7N3)]
method: RPBEPBE
basis: SDD
operation: Freq
keyword: #pfreq=noraman
keyword: PBEPBE/SDD
title: #p freq=noraman PBEPBE/SDD
converged: NO NO NO NO
title: Mulliken charges:
elementType: N N N C C C C C C C C C C H H H H H H H
charge: -0.310857 -0.115420 -0.106509 0.237888 0.357484 0.162899 -0.282861 -0.254738 -0.334303 -0.390529 -0.218586 -0.223000 -0.249507 0.246060 0.257035 0.240680 0.240886 0.268425 0.237316 0.237638
chargesum: 0.00000
title: Mulliken charges with hydrogens summed into heavy atoms:
elementType: N N N C C C C C C C C C C
charge: -0.310857 -0.115420 -0.106509 0.237888 0.357484 0.162899 -0.036802 0.002297 -0.093622 -0.149643 0.049839 0.014315 -0.011870
polarizability: 1.92319456e+02 8.30802122e-01 1.37801661e+02 -1.97422424e-02 7.19896750e-03 4.87714841e+01
1716.lowfreq: -4.3985 -0.0006 -0.0003 0.0003 14.7795 17.0186 115.1191 129.5689 248.8759
frequency: 115.1137 129.5641 248.8758 256.6151 287.4232 417.1432 431.8544 455.5133 511.7090 515.8945 558.4635 621.9569 640.6987 682.4569 691.1266 738.8049 755.2855 761.6861 775.9016 821.5832 862.9155 874.2969 921.3830 951.4281 961.6328 971.9754 991.7538 991.9559 1037.7936 1093.8104 1134.5300 1166.5393 1182.4215 1191.1474 1234.2340 1271.2280 1294.7566 1331.1760 1348.1679 1394.4817 1402.4383 1437.1932 1466.7260 1524.9923 1557.8842 1615.2730 1619.8372 3133.1571 3142.2509 3147.9058 3156.3118 3171.8382 3190.1095 3260.9426
redmass: 4.9735 4.9877 4.1175 5.5003 5.0210 3.1158 8.1487 5.5552 5.7140 3.5787 3.1999 6.4398 4.7286 6.5086 2.9716 1.6508 6.5054 1.3302 3.5049 1.4544 4.2509 1.5405 6.4111 1.3622 9.4755 1.3204 6.4677 1.3402 2.0856 2.0870 1.4935 1.5929 1.1780 2.3719 1.8486 3.5180 1.7311 2.7780 2.9305 4.3722 6.4649 2.5724 2.7659 4.8332 6.0540 7.4078 6.7917 1.0869 1.0890 1.0899 1.0947 1.1007 1.0968 1.0989
irintensity: 1.3741 1.1777 3.8457 1.9434 7.5025 8.5357 1.3382 3.8366 3.9259 5.1789 0.4842 1.0595 2.5818 2.4900 0.1346 10.5860 0.4666 76.9694 2.3919 79.2331 0.0361 6.1421 8.7747 3.8977 1.3649 0.8434 0.2116 0.0334 5.1565 1.4436 7.0408 20.2948 5.1089 7.7321 8.5277 36.6786 0.0352 2.2721 0.9183 11.0035 20.6845 12.8914 16.4062 6.2451 10.2197 6.9927 5.6227 1.5869 2.9095 6.7922 18.4957 17.3724 3.2528 0.5814
temp: 298.150 k
press: 1.00000 atm
elementType: 7 7 7 6 6 6 6 6 6 6 6 6 6 1 1 1 1 1 1 1
symmnumber: 1
zpe: 391490.8 jmol-1
zpe.correction: 0.149111 hartree
zpe.thermalcorrener: 0.157745 hartree
zpe.thermalcorrenthalpy: 0.158689 hartree
zpe.thermalcorrgfe: 0.115252 hartree
zpe.sumelectzpe: -548.623306 hartree
zpe.sumelectthermal: -548.614672 hartree
zpe.sumelectthermalent: -548.613728 hartree
zpe.sumelectthermalfe: -548.657165 hartree
dipole: -6.8502 0.2853 0.0005
dipole: 6.8561
quadrupole: -90.0840 -61.1319 -78.9744
quadrupole: 3.1049 0.0013 0.0016
quadrupole: -13.3539 15.5982 -2.2443 3.1049 0.0013 0.0016
hfenergy: -548.7724172 hartree
pointgroup: C01 [X(C10H7N3)]
dipole: -2.6947673 0.1190431 0.0001927 debye
dipolederiv: -0.7957339 -0.0961364 0.0000689 -0.2441885 -0.1124677 0.0000167 0.0001054 -0.0000235 0.0445802 -0.4046659 0.2187986 0.0000291 0.0330314 -0.190823 -0.0000006 -0.0000063 -0.0000174 -0.2335173 -0.2008595 -0.0737778 -0.000001 0.1252476 -0.0834111 -0.0000409 0.0000511 -0.0000052 -0.2437954 0.5459004 0.0652091 -0.0000748 -0.0223359 0.0315329 0.0000133 -0.0000804 0.0000024 0.0862232 -0.0728003 0.0912968 0.000017 0.1303209 -0.0741106 -0.0000398 0.0000078 -0.0000457 0.0379808 0.5643028 -0.0843436 -0.0000514 0.2160079 0.0035796 -0.0000063 -0.000057 0.0000498 0.0843133 0.0252793 -0.0041292 -0.0000417 0.1312581 0.1187411 -0.0000001 0.0000287 0.0000104 -0.1647798 -0.0320352 0.0221458 -0.0000464 -0.074957 0.1257647 0.0000139 -0.0000243 -0.000014 -0.1098444 -0.1416463 -0.0396268 -0.0000214 -0.0412656 0.0196094 0.0000674 -0.0000208 0.0000917 -0.1567753 0.091917 -0.0494377 -0.0000155 -0.0906811 0.1209294 0.0000355 -0.0000111 0.0000128 -0.1536351 0.1887522 -0.0601598 0.0000137 -0.0792141 0.0519792 0.0000033 -0.0000316 0.0000237 -0.0655035 -0.0746754 0.0395576 0.0000205 0.0657732 0.1031089 0.0000446 0.0000506 0.0000499 -0.1489795 0.0964629 -0.0283925 -0.0000492 -0.146376 -0.1088759 0.0000266 -0.0001188 0.0000014 -0.1535604 0.0466356 0.10163 0.0000279 0.0233076 -0.0453856 -0.0000182 0.0000123 -0.0000084 0.1568229 0.0587932 -0.0735215 0.0000242 -0.0291283 0.0260309 0.0000043 0.0000201 0.0000109 0.171028 0.050859 0.0966655 0.0000426 0.046155 -0.0268914 -0.0000524 0.0000294 -0.000082 0.1662964 0.0648485 0.0287862 0.0000105 0.0856619 -0.069529 -0.0000315 0.0000002 -0.0000147 0.1544014 0.0889202 -0.0853442 0.0000039 -0.0463324 0.0526623 0.0000002 -0.0000053 0.0000031 0.2024089 0.018355 -0.0853284 -0.0000012 -0.0989316 -0.035315 -0.000025 -0.000027 -0.0000388 0.1605336 -0.1186095 0.0161083 0.0000443 0.0166467 0.0928708 -0.0000112 0.0000769 -0.0000064 0.1658021 unknown
polarizability: 192.323307|0.6930083|137.7978098|-0.019724|0.0072488|48.7714841 unknown
InChI: InChI=1S/C10H7N3/c1-2-4-9-8(3-1)5-6-10-12-11-7-13(9)10/h1-7H
charge 0 multiplicity 1
20 atoms
N  0.904765 -0.507218 -0.000141
N  3.053658 0.244938 -0.00034
N  3.061754 -1.171047 -0.000315
C  -0.506686 -0.41852 0.000172
C  -1.076873 0.900226 0.000406
C  1.748786 0.635389 -0.00021
C  -0.209874 2.06974 0.000324
C  1.165444 1.946462 -0.000027
C  -1.331063 -1.568678 0.000087
C  -2.4959 1.017282 0.000577
C  1.777444 -1.597263 -0.000242
C  -2.730657 -1.418084 0.000294
C  -3.316402 -0.123912 0.000492
H  -0.679219 3.059176 0.000456
H  1.837513 2.807824 -0.000177
H  -0.892691 -2.571728 -0.000256
H  -2.944577 2.017205 0.000703
H  1.471541 -2.638452 -0.000255
H  -3.368362 -2.308484 0.000182
H  -4.405999 -0.016956 0.000669
