program: Orca
programVersion: 5.0.2
elementType: F F O O O O N C C C C C C C C C C C C C C C C C C C C C C C C C C H H H H H H H H H H H H H H H H H H H H H H H
charge: 0
multiplicity: 1
keywords: wb97x-d3
keywords: def2-TZVPP
keywords: def2/J RIJCOSX
keywords: DEFGRID2
keywords: scfconv7
keywords: smallprint printgap noloewdin
keywords: NOSOSCF
formula: C26H23F2NO4
InChI: InChI=1/C26H23F2NO4/c1-17(2)24(18-11-13-21(14-12-18)32-26(27)28)25(30)33-23(16-29)19-7-6-10-22(15-19)31-20-8-4-3-5-9-20/h3-15,17,23-24,26H,1-2H3
56 atoms
F  -4.728028 -1.782682 1.213518
F  -3.953527 -2.186272 -0.765958
O  3.215344 0.309758 0.781074
O  3.404236 -0.101711 -1.405569
O  -2.693923 -2.501963 1.043794
O  -1.445872 2.284134 0.771277
N  4.078267 2.775953 2.800001
C  2.875041 -1.912686 0.133754
C  3.447937 -3.017187 -0.779915
C  1.379599 -2.017411 0.348931
C  2.821544 -3.122619 -2.164987
C  4.968534 -2.917746 -0.87087
C  3.205103 -0.501309 -0.294326
C  0.886673 -2.675794 1.471899
C  0.460781 -1.506402 -0.559433
C  3.367529 1.695904 0.528578
C  -0.471413 -2.81978 1.68523
C  -0.90595 -1.65415 -0.370282
C  -1.373643 -2.307334 0.762017
C  2.095018 2.334111 0.022045
C  0.874345 1.984462 0.585208
C  2.155164 3.284932 -0.983941
C  -0.280013 2.610159 0.145608
C  3.763062 2.286832 1.809756
C  0.992222 3.909957 -1.409312
C  -0.22885 3.583335 -0.845896
C  -3.629834 -1.707011 0.456323
C  -2.553099 1.944755 0.057699
C  -2.511471 1.459895 -1.245426
C  -3.767638 2.048796 0.726648
C  -3.693469 1.083231 -1.868687
C  -4.936786 1.660521 0.092942
C  -4.908413 1.177108 -1.207931
H  3.34419 -2.050345 1.113465
H  3.212717 -3.947317 -0.250258
H  3.01975 -2.24147 -2.772485
H  1.743873 -3.274215 -2.116075
H  3.24107 -3.983787 -2.686755
H  5.430902 -2.845744 0.115822
H  5.378743 -3.803572 -1.35645
H  5.284088 -2.053479 -1.455489
H  1.57738 -3.078491 2.203078
H  0.803194 -0.990204 -1.44759
H  4.175839 1.873271 -0.189097
H  -0.840352 -3.324825 2.568002
H  -1.579711 -1.273296 -1.124558
H  0.807833 1.2368 1.365772
H  3.104808 3.540736 -1.435855
H  1.037243 4.660155 -2.187006
H  -1.133661 4.079801 -1.172158
H  -3.31771 -0.664714 0.354716
H  -1.571259 1.366678 -1.772826
H  -3.784088 2.421908 1.742168
H  -3.656173 0.700484 -2.879946
H  -5.876295 1.733948 0.623961
H  -5.821622 0.869298 -1.69768
totalener: -1560.09161223 hartree
nucrepener: 3455.59273714 hartree
electener: -5015.68434937 hartree
oneelecener: -9001.60165378 hartree
twoeener: 3985.91730442 hartree
kineticenergy: 1553.71070270 hartree
xcener: -146.830966349622 hartree
chargesum: -0.0000000
charge: -0.181240 -0.195232 -0.258276 -0.342184 -0.260802 -0.290070 0.003651 0.127813 0.041613 0.025030 -0.293240 -0.285499 0.255286 -0.146906 -0.288137 0.302129 -0.179359 -0.158917 0.249270 0.084818 -0.239613 -0.143207 0.226132 -0.256567 -0.093122 -0.177120 0.512858 0.313431 -0.250784 -0.215978 -0.118125 -0.090876 -0.145808 0.091280 0.048141 0.099636 0.092650 0.089740 0.090568 0.090488 0.095788 0.111417 0.140392 0.124547 0.127472 0.129494 0.131445 0.108978 0.131870 0.138904 -0.026601 0.138201 0.129141 0.130032 0.127482 0.127967
qa: -0.1812 -0.1952 -0.2583 -0.3422 -0.2608 -0.2901 0.0037 0.1278 0.0416 0.0250 -0.2932 -0.2855 0.2553 -0.1469 -0.2881 0.3021 -0.1794 -0.1589 0.2493 0.0848 -0.2396 -0.1432 0.2261 -0.2566 -0.0931 -0.1771 0.5129 0.3134 -0.2508 -0.2160 -0.1181 -0.0909 -0.1458 0.0913 0.0481 0.0996 0.0927 0.0897 0.0906 0.0905 0.0958 0.1114 0.1404 0.1245 0.1275 0.1295 0.1314 0.1090 0.1319 0.1389 -0.0266 0.1382 0.1291 0.1300 0.1275 0.1280
va: 1.1086 1.0779 2.1345 2.1335 2.1391 2.1099 3.1197 3.7338 3.8350 3.5630 3.9291 3.9275 4.2889 4.0301 3.9808 3.8405 4.0426 3.9103 3.9439 3.6106 4.0649 4.0365 3.8421 4.0263 3.9406 3.9791 4.2743 3.6667 3.8663 3.9867 3.9257 3.9011 3.9406 1.0354 1.0164 1.0135 1.0025 1.0078 1.0042 1.0065 1.0087 1.0092 1.0146 1.0189 1.0139 1.0164 1.0221 1.0123 1.0002 1.0012 1.0125 1.0050 1.0160 1.0022 1.0008 1.0022
dispcorr: -0.035474287 hartree
energy: -1560.127086518336
dipole: 22.00175 -22.07921 -0.07746 -7.15920 7.09402 -0.06518 -14.24596 13.04063 -1.20532
magnitude: 1.20957 au
magnitude: 3.07447 debye
