program: Orca
programVersion: 5.0.2
elementType: F F O O O O N C C C C C C C C C C C C C C C C C C C C C C C C C C H H H H H H H H H H H H H H H H H H H H H H H
charge: 0
multiplicity: 1
keywords: wb97x-d3
keywords: def2-TZVPP
keywords: def2/J RIJCOSX
keywords: DEFGRID2
keywords: scfconv7
keywords: smallprint printgap noloewdin
keywords: NOSOSCF
formula: C26H23F2NO4
InChI: InChI=1/C26H23F2NO4/c1-17(2)24(18-11-13-21(14-12-18)32-26(27)28)25(30)33-23(16-29)19-7-6-10-22(15-19)31-20-8-4-3-5-9-20/h3-15,17,23-24,26H,1-2H3
56 atoms
F  -3.461815 -3.324829 1.16086
F  -4.309444 -1.951837 -0.278106
O  3.048661 0.480193 0.794136
O  3.934624 -0.126115 -1.168783
O  -2.251419 -2.561754 -0.546272
O  -2.093931 0.968148 0.171976
N  2.574969 3.421763 2.261346
C  3.285469 -1.826938 0.425132
C  4.213123 -2.863746 -0.221957
C  1.807623 -2.071807 0.186631
C  5.672504 -2.575252 0.117435
C  3.835652 -4.26896 0.232839
C  3.50861 -0.424282 -0.089564
C  0.947514 -2.331034 1.24209
C  1.271694 -1.995071 -1.097804
C  2.722925 1.755809 0.255977
C  -0.41323 -2.518765 1.040269
C  -0.08268 -2.15517 -1.314384
C  -0.927891 -2.411329 -0.243365
C  1.414895 1.681078 -0.494345
C  0.245468 1.364431 0.190829
C  1.387291 1.882803 -1.864874
C  -0.945933 1.278117 -0.504139
C  2.6428 2.672452 1.393716
C  0.184782 1.785422 -2.55229
C  -0.9851 1.489345 -1.877005
C  -3.184618 -2.251206 0.386926
C  -3.033225 1.955535 0.322414
C  -4.358767 1.556339 0.423493
C  -2.693594 3.29954 0.407246
C  -5.344922 2.507944 0.625217
C  -3.694374 4.240335 0.601251
C  -5.020632 3.853826 0.712864
H  3.458391 -1.831092 1.506905
H  4.09225 -2.805925 -1.307722
H  5.837043 -2.613416 1.196956
H  6.000385 -1.600359 -0.240949
H  6.326194 -3.321265 -0.33545
H  2.815436 -4.532987 -0.043466
H  4.501458 -5.006341 -0.216161
H  3.923534 -4.369187 1.317439
H  1.339784 -2.400347 2.249078
H  1.912497 -1.781706 -1.943992
H  3.515913 2.11563 -0.406856
H  -1.041379 -2.764322 1.885771
H  -0.495112 -2.070041 -2.31058
H  0.252125 1.195528 1.260875
H  2.301221 2.107895 -2.398455
H  0.161806 1.941344 -3.622277
H  -1.927335 1.419715 -2.405308
H  -2.89706 -1.416059 1.03166
H  -4.617803 0.510556 0.33303
H  -1.662236 3.618317 0.332665
H  -6.376298 2.190758 0.704351
H  -3.426305 5.286195 0.670697
H  -5.794142 4.59348 0.867307
totalener: -1560.09275535 hartree
nucrepener: 3452.01897174 hartree
electener: -5012.11172709 hartree
oneelecener: -8994.62534206 hartree
twoeener: 3982.51361497 hartree
kineticenergy: 1553.72539016 hartree
xcener: -146.827838300763 hartree
chargesum: -0.0000000
charge: -0.191993 -0.183319 -0.260886 -0.345147 -0.250472 -0.332161 0.001285 0.065134 0.063999 -0.041442 -0.275556 -0.282803 0.287182 -0.158081 -0.137677 0.339523 -0.108917 -0.179063 0.194052 0.058238 -0.218426 -0.104575 0.166433 -0.276659 -0.108119 -0.133622 0.390578 0.236069 -0.214560 -0.133676 -0.115399 -0.129783 -0.136999 0.088026 0.044084 0.080356 0.100934 0.085572 0.101012 0.092064 0.077350 0.108869 0.125977 0.123999 0.131692 0.124810 0.115911 0.118349 0.133199 0.136396 0.073155 0.143301 0.131342 0.126894 0.128042 0.125506
qa: -0.1920 -0.1833 -0.2609 -0.3451 -0.2505 -0.3322 0.0013 0.0651 0.0640 -0.0414 -0.2756 -0.2828 0.2872 -0.1581 -0.1377 0.3395 -0.1089 -0.1791 0.1941 0.0582 -0.2184 -0.1046 0.1664 -0.2767 -0.1081 -0.1336 0.3906 0.2361 -0.2146 -0.1337 -0.1154 -0.1298 -0.1370 0.0880 0.0441 0.0804 0.1009 0.0856 0.1010 0.0921 0.0774 0.1089 0.1260 0.1240 0.1317 0.1248 0.1159 0.1183 0.1332 0.1364 0.0732 0.1433 0.1313 0.1269 0.1280 0.1255
va: 1.0830 1.0945 2.1509 2.1472 2.0812 2.0040 3.1179 3.7619 3.8128 3.5639 3.9291 3.9483 4.2969 4.0360 3.9413 3.8106 3.8904 4.0170 3.8894 3.5737 4.0527 3.9600 3.8153 4.0393 3.9414 4.0051 4.2853 3.8234 4.0038 3.9277 4.0034 3.9751 3.9538 1.0368 1.0264 1.0040 1.0146 1.0074 1.0035 1.0076 1.0049 1.0140 1.0205 1.0181 1.0160 1.0143 1.0319 1.0167 0.9989 1.0050 0.9958 1.0162 1.0050 1.0013 0.9998 1.0002
dispcorr: -0.035649040 hartree
energy: -1560.128404388326
dipole: 25.27238 -24.97534 0.29703 -4.16974 3.92922 -0.24051 -3.19800 2.44881 -0.74919
magnitude: 0.84105 au
magnitude: 2.13778 debye
