program: Orca
programVersion: 5.0.2
elementType: F F O O O O N C C C C C C C C C C C C C C C C C C C C C C C C C C H H H H H H H H H H H H H H H H H H H H H H H
charge: 0
multiplicity: 1
keywords: wb97x-d3
keywords: def2-TZVPP
keywords: def2/J RIJCOSX
keywords: DEFGRID2
keywords: scfconv7
keywords: smallprint printgap noloewdin
keywords: NOSOSCF
formula: C26H23F2NO4
InChI: InChI=1/C26H23F2NO4/c1-17(2)24(18-11-13-21(14-12-18)32-26(27)28)25(30)33-23(16-29)19-7-6-10-22(15-19)31-20-8-4-3-5-9-20/h3-15,17,23-24,26H,1-2H3
56 atoms
F  -3.351131 -2.918342 1.94146
F  -4.49047 -1.731007 0.546467
O  3.229251 0.316208 0.78375
O  3.749734 -0.015524 -1.366701
O  -2.488056 -2.301339 -0.027056
O  -1.655278 1.191383 0.01718
N  3.283039 2.869999 2.881887
C  3.171014 -1.906483 0.035881
C  3.877868 -2.886036 -0.911595
C  1.660534 -2.030733 0.040288
C  5.394254 -2.76062 -0.795449
C  3.442736 -4.316542 -0.612111
C  3.449679 -0.45714 -0.295731
C  0.973049 -2.329056 1.206207
C  0.923183 -1.814431 -1.121974
C  3.134453 1.711009 0.544854
C  -0.412035 -2.429193 1.229517
C  -0.455682 -1.897584 -1.11449
C  -1.126109 -2.205301 0.061952
C  1.842811 2.081141 -0.148778
C  0.652034 1.490488 0.248595
C  1.856339 3.024332 -1.165086
C  -0.530479 1.84143 -0.387148
C  3.216794 2.344055 1.862973
C  0.66719 3.375905 -1.782193
C  -0.529798 2.789544 -1.404354
C  -3.259142 -1.924336 1.026963
C  -2.877368 1.781388 -0.178683
C  -3.807327 1.123073 -0.965467
C  -3.191998 2.980912 0.446096
C  -5.073727 1.669476 -1.120333
C  -4.456565 3.520696 0.275405
C  -5.400474 2.868283 -0.506271
H  3.526617 -2.095634 1.05481
H  3.590915 -2.643221 -1.9390
H  5.888125 -3.473307 -1.456649
H  5.728407 -2.976987 0.222094
H  5.753293 -1.76873 -1.066159
H  2.371847 -4.46052 -0.750077
H  3.958051 -5.017089 -1.269687
H  3.685307 -4.595732 0.416099
H  1.522989 -2.500165 2.123356
H  1.42652 -1.558191 -2.045897
H  3.983071 2.062793 -0.05175
H  -0.904178 -2.704136 2.15169
H  -1.021574 -1.717025 -2.018576
H  0.626711 0.751915 1.040546
H  2.788588 3.473427 -1.481941
H  0.670091 4.105923 -2.580277
H  -1.448518 3.065004 -1.904879
H  -2.897307 -1.020458 1.527828
H  -3.543098 0.188655 -1.442321
H  -2.457409 3.482098 1.063677
H  -5.804853 1.152725 -1.727306
H  -4.707569 4.452816 0.763957
H  -6.388245 3.290899 -0.629869
totalener: -1560.09339017 hartree
nucrepener: 3439.89496543 hartree
electener: -4999.98835559 hartree
oneelecener: -8970.57329237 hartree
twoeener: 3970.58493677 hartree
kineticenergy: 1553.71056730 hartree
xcener: -146.824793334552 hartree
chargesum: -0.0000000
charge: -0.193442 -0.177601 -0.261816 -0.334203 -0.260532 -0.294981 0.000640 0.066881 0.061619 -0.061490 -0.277583 -0.279933 0.271963 -0.175419 -0.088611 0.296062 -0.118216 -0.202154 0.213172 0.100377 -0.261985 -0.141812 0.217984 -0.260543 -0.110367 -0.163214 0.368593 0.194514 -0.180650 -0.156661 -0.099138 -0.116385 -0.124389 0.087235 0.044222 0.084824 0.080846 0.101420 0.100686 0.090931 0.078223 0.108609 0.128013 0.125522 0.136901 0.124146 0.131363 0.106112 0.128925 0.134074 0.098082 0.131766 0.139096 0.129377 0.130310 0.128638
qa: -0.1934 -0.1776 -0.2618 -0.3342 -0.2605 -0.2950 0.0006 0.0669 0.0616 -0.0615 -0.2776 -0.2799 0.2720 -0.1754 -0.0886 0.2961 -0.1182 -0.2022 0.2132 0.1004 -0.2620 -0.1418 0.2180 -0.2605 -0.1104 -0.1632 0.3686 0.1945 -0.1806 -0.1567 -0.0991 -0.1164 -0.1244 0.0872 0.0442 0.0848 0.0808 0.1014 0.1007 0.0909 0.0782 0.1086 0.1280 0.1255 0.1369 0.1241 0.1314 0.1061 0.1289 0.1341 0.0981 0.1318 0.1391 0.1294 0.1303 0.1286
va: 1.0800 1.1005 2.1357 2.1601 2.0618 2.0552 3.1216 3.7612 3.8195 3.5367 3.9308 3.9467 4.2906 4.0328 3.9146 3.8423 3.9288 4.0283 3.8807 3.6312 4.0812 4.0192 3.8350 4.0313 3.9820 3.9630 4.2839 3.7644 3.9682 4.0008 3.9550 3.9504 3.9484 1.0362 1.0265 1.0075 1.0037 1.0146 1.0037 1.0077 1.0049 1.0154 1.0177 1.0166 1.0195 1.0105 1.0153 1.0125 1.0010 1.0068 0.9857 1.0208 1.0024 1.0004 0.9991 0.9993
dispcorr: -0.035154094 hartree
energy: -1560.128544261644
dipole: 22.81226 -22.96988 -0.15762 -5.37418 5.40724 0.03306 -11.75180 10.70225 -1.04955
magnitude: 1.06184 au
magnitude: 2.69897 debye
