program: Orca
programVersion: 5.0.2
elementType: F F O O O O N C C C C C C C C C C C C C C C C C C C C C C C C C C H H H H H H H H H H H H H H H H H H H H H H H
charge: 0
multiplicity: 1
keywords: wb97x-d3
keywords: def2-TZVPP
keywords: def2/J RIJCOSX
keywords: DEFGRID2
keywords: scfconv7
keywords: smallprint printgap noloewdin
keywords: NOSOSCF
formula: C26H23F2NO4
InChI: InChI=1/C26H23F2NO4/c1-17(2)24(18-11-13-21(14-12-18)32-26(27)28)25(30)33-23(16-29)19-7-6-10-22(15-19)31-20-8-4-3-5-9-20/h3-15,17,23-24,26H,1-2H3
56 atoms
F  -2.980508 -0.862812 -2.85029
F  -4.36808 -2.308275 -2.036078
O  2.814412 0.457963 1.154126
O  3.909394 -0.139479 -0.705234
O  -2.635341 -1.804675 -0.857013
O  -2.081756 1.372246 -0.406718
N  2.291948 3.285317 2.783292
C  2.831204 -1.831343 0.650129
C  3.700755 -2.943082 0.051173
C  1.378764 -1.863688 0.214007
C  5.124232 -2.874061 0.596875
C  3.088219 -4.308674 0.344423
C  3.292282 -0.441279 0.275648
C  1.031103 -1.703479 -1.121171
C  0.356456 -1.978436 1.148971
C  2.693268 1.79391 0.676886
C  -0.295657 -1.66733 -1.524805
C  -0.971146 -1.964744 0.764406
C  -1.297925 -1.813277 -0.575789
C  1.54159 1.895143 -0.294501
C  0.255429 1.607453 0.148628
C  1.779954 2.199516 -1.625248
C  -0.801197 1.659575 -0.747815
C  2.470769 2.61868 1.865488
C  0.716942 2.22812 -2.516856
C  -0.570023 1.964881 -2.085371
C  -3.071641 -1.999262 -2.125361
C  -2.573331 1.649934 0.837514
C  -2.242483 2.805465 1.535079
C  -3.493002 0.750997 1.359575
C  -2.826889 3.043083 2.76998
C  -4.076326 1.008568 2.589905
C  -3.743124 2.149755 3.304419
H  2.856586 -1.920335 1.741894
H  3.740418 -2.805919 -1.033535
H  5.617315 -1.93274 0.357969
H  5.734841 -3.67379 0.176508
H  5.13328 -2.996043 1.68271
H  2.093292 -4.416214 -0.086242
H  3.713482 -5.10336 -0.063649
H  3.003857 -4.479807 1.420369
H  1.800413 -1.568178 -1.871075
H  0.598822 -2.082623 2.199233
H  3.620555 2.126511 0.200004
H  -0.51557 -1.481089 -2.566642
H  -1.758874 -2.06124 1.499661
H  0.081171 1.34541 1.185185
H  2.786554 2.399659 -1.967324
H  0.89348 2.461773 -3.558184
H  -1.404733 1.990835 -2.773345
H  -2.532703 -2.793144 -2.655066
H  -1.539624 3.519163 1.125207
H  -3.755496 -0.13312 0.794778
H  -2.563695 3.941064 3.312954
H  -4.796457 0.307584 2.991131
H  -4.197111 2.34458 4.266585
totalener: -1560.09147314 hartree
nucrepener: 3527.97646821 hartree
electener: -5088.06794135 hartree
oneelecener: -9147.03443804 hartree
twoeener: 4058.96649669 hartree
kineticenergy: 1553.72474733 hartree
xcener: -146.831673586347 hartree
chargesum: -0.0000000
charge: -0.189062 -0.180654 -0.261547 -0.340887 -0.268948 -0.288338 -0.001438 0.059335 0.061037 -0.036602 -0.275993 -0.280728 0.283242 -0.186906 -0.111956 0.340579 -0.143055 -0.191082 0.266901 0.045774 -0.243362 -0.130553 0.267406 -0.277067 -0.079145 -0.238508 0.376410 0.305076 -0.194741 -0.273653 -0.107366 -0.082749 -0.150308 0.087660 0.044228 0.102206 0.084997 0.080251 0.098327 0.091228 0.078195 0.123480 0.109107 0.122461 0.124538 0.123897 0.131458 0.112893 0.128641 0.131361 0.098123 0.133956 0.141328 0.129431 0.126008 0.125117
qa: -0.1891 -0.1807 -0.2615 -0.3409 -0.2689 -0.2883 -0.0014 0.0593 0.0610 -0.0366 -0.2760 -0.2807 0.2832 -0.1869 -0.1120 0.3406 -0.1431 -0.1911 0.2669 0.0458 -0.2434 -0.1306 0.2674 -0.2771 -0.0791 -0.2385 0.3764 0.3051 -0.1947 -0.2737 -0.1074 -0.0827 -0.1503 0.0877 0.0442 0.1022 0.0850 0.0803 0.0983 0.0912 0.0782 0.1235 0.1091 0.1225 0.1245 0.1239 0.1315 0.1129 0.1286 0.1314 0.0981 0.1340 0.1413 0.1294 0.1260 0.1251
va: 1.0817 1.1087 2.1495 2.1534 2.1023 2.0851 3.1193 3.7593 3.8170 3.5740 3.9291 3.9476 4.3106 4.0317 3.9810 3.8350 3.9039 4.0023 3.7634 3.6435 3.9758 3.9856 3.7121 4.0425 3.9286 4.0312 4.2898 3.7708 3.9711 3.9893 3.9531 3.9394 3.9749 1.0364 1.0260 1.0147 1.0071 1.0041 1.0037 1.0076 1.0052 1.0238 1.0102 1.0167 1.0189 1.0124 1.0167 1.0178 0.9985 1.0153 0.9831 1.0044 1.0333 0.9995 1.0005 1.0003
dispcorr: -0.037561638 hartree
energy: -1560.129034780123
dipole: 24.53013 -24.18815 0.34198 -12.59549 11.35396 -1.24154 9.73455 -10.38596 -0.65141
magnitude: 1.44316 au
magnitude: 3.66821 debye
