program: Orca
programVersion: 5.0.2
elementType: F F O O O O N C C C C C C C C C C C C C C C C C C C C C C C C C C H H H H H H H H H H H H H H H H H H H H H H H
charge: 0
multiplicity: 1
keywords: wb97x-d3
keywords: def2-TZVPP
keywords: def2/J RIJCOSX
keywords: DEFGRID2
keywords: scfconv7
keywords: smallprint printgap noloewdin
keywords: NOSOSCF
formula: C26H23F2NO4
InChI: InChI=1/C26H23F2NO4/c1-17(2)24(18-11-13-21(14-12-18)32-26(27)28)25(30)33-23(16-29)19-7-6-10-22(15-19)31-20-8-4-3-5-9-20/h3-15,17,23-24,26H,1-2H3
56 atoms
F  -4.796028 -2.399275 0.517507
F  -3.624391 -1.510368 2.105915
O  3.293128 0.301543 0.680276
O  3.458561 0.011709 -1.53309
O  -2.82334 -1.668973 0.027885
O  -1.441493 1.889973 0.823636
N  4.215372 2.659259 2.804553
C  2.841712 -1.857825 -0.121545
C  3.416799 -2.881942 -1.110426
C  1.32786 -1.833386 -0.060544
C  4.941705 -2.89453 -1.049538
C  2.864344 -4.271921 -0.814748
C  3.254292 -0.438066 -0.443049
C  0.661222 -2.022994 1.139295
C  0.568409 -1.577778 -1.201291
C  3.397271 1.705305 0.513413
C  -0.724617 -1.966041 1.220883
C  -0.8107 -1.543078 -1.144311
C  -1.461827 -1.736961 0.068235
C  2.07747 2.33159 0.122793
C  0.88893 1.813412 0.617822
C  2.064485 3.436947 -0.713265
C  -0.312814 2.41258 0.275667
C  3.852106 2.223852 1.80596
C  0.857329 4.039825 -1.033195
C  -0.335117 3.538208 -0.540367
C  -3.554571 -2.276419 0.993347
C  -2.538403 1.62038 0.058243
C  -3.742865 1.504565 0.738598
C  -2.482351 1.405149 -1.312686
C  -4.891121 1.164243 0.045147
C  -3.644659 1.075035 -1.994489
C  -4.850919 0.950105 -1.324981
H  3.214146 -2.101847 0.87898
H  3.116903 -2.595768 -2.122689
H  5.346565 -3.634269 -1.740766
H  5.29234 -3.158558 -0.049008
H  5.378273 -1.932862 -1.317292
H  3.120813 -4.590744 0.198469
H  1.779996 -4.315735 -0.910816
H  3.286643 -5.004349 -1.503237
H  1.227743 -2.2042 2.044474
H  1.05755 -1.402244 -2.151192
H  4.156433 1.953017 -0.236383
H  -1.194444 -2.071663 2.188629
H  -1.396822 -1.358208 -2.034168
H  0.874197 0.946663 1.266141
H  2.990173 3.830091 -1.113958
H  0.844102 4.909458 -1.676215
H  -1.27437 4.01429 -0.790279
H  -3.16482 -3.260606 1.27963
H  -3.768002 1.667358 1.807755
H  -1.545569 1.479152 -1.848799
H  -5.824941 1.066537 0.58251
H  -3.598107 0.907591 -3.062826
H  -5.750185 0.684457 -1.863464
totalener: -1560.09087169 hartree
nucrepener: 3496.07266576 hartree
electener: -5056.16353745 hartree
oneelecener: -9083.22084308 hartree
twoeener: 4027.05730562 hartree
kineticenergy: 1553.73206640 hartree
xcener: -146.832625372342 hartree
chargesum: 0.0000000
charge: -0.181343 -0.198298 -0.264122 -0.338126 -0.256812 -0.293918 0.002564 0.079479 0.052662 -0.050435 -0.277346 -0.279208 0.273198 -0.205788 -0.099941 0.283010 -0.111435 -0.225837 0.235995 0.096225 -0.228601 -0.155537 0.221474 -0.254801 -0.095344 -0.182159 0.374410 0.350380 -0.260972 -0.248354 -0.080893 -0.104243 -0.142309 0.086427 0.047354 0.085347 0.082493 0.100705 0.079003 0.098194 0.090898 0.113201 0.126370 0.127395 0.134639 0.134324 0.143420 0.107236 0.129986 0.138905 0.114204 0.120784 0.135245 0.122970 0.125380 0.121945
qa: -0.1813 -0.1983 -0.2641 -0.3381 -0.2568 -0.2939 0.0026 0.0795 0.0527 -0.0504 -0.2773 -0.2792 0.2732 -0.2058 -0.0999 0.2830 -0.1114 -0.2258 0.2360 0.0962 -0.2286 -0.1555 0.2215 -0.2548 -0.0953 -0.1822 0.3744 0.3504 -0.2610 -0.2484 -0.0809 -0.1042 -0.1423 0.0864 0.0474 0.0853 0.0825 0.1007 0.0790 0.0982 0.0909 0.1132 0.1264 0.1274 0.1346 0.1343 0.1434 0.1072 0.1300 0.1389 0.1142 0.1208 0.1352 0.1230 0.1254 0.1219
va: 1.1131 1.0725 2.1318 2.1558 2.1132 2.0907 3.1219 3.7478 3.8256 3.5495 3.9317 3.9472 4.2825 4.0359 3.9481 3.8425 3.9107 4.0357 3.8571 3.6446 4.0622 4.0384 3.8717 4.0213 3.9367 3.9774 4.2715 3.5957 4.0297 3.8933 3.8916 3.9436 3.9896 1.0378 1.0255 1.0071 1.0040 1.0136 1.0050 1.0035 1.0078 1.0141 1.0196 1.0188 1.0187 1.0068 1.0101 1.0117 1.0005 1.0018 0.9810 1.0187 1.0049 0.9983 0.9988 1.0003
dispcorr: -0.036829826 hartree
energy: -1560.127701516345
dipole: 21.27935 -21.55211 -0.27276 -11.62866 10.51222 -1.11644 -14.43290 13.28235 -1.15055
magnitude: 1.62623 au
magnitude: 4.13355 debye
