program: Orca
programVersion: 5.0.2
elementType: Cl O O O N C C C C C C C C C C C C C C C C C C C C C C C C C H H H H H H H H H H H H H H H H H H H H H H
charge: 0
multiplicity: 1
keywords: wb97x-d3
keywords: def2-TZVPP
keywords: def2/J RIJCOSX
keywords: DEFGRID2
keywords: scfconv7
keywords: smallprint printgap noloewdin
keywords: NOSOSCF
formula: C25H22ClNO3
InChI: InChI=1/C25H22ClNO3/c1-17(2)24(18-11-13-20(26)14-12-18)25(28)30-23(16-27)19-7-6-10-22(15-19)29-21-8-4-3-5-9-21/h3-15,17,23-24H,1-2H3
52 atoms
Cl 0.765185 -4.899496 4.151846
O  1.42226 0.439648 0.471912
O  3.032781 0.313461 -1.067526
O  -2.27376 3.502552 -1.49535
N  0.950033 2.302025 3.164582
C  1.522575 -1.549995 -0.801122
C  0.247094 -1.404367 -1.669774
C  1.315507 -2.365246 0.455334
C  0.523603 -0.587418 -2.927717
C  -0.280089 -2.781602 -2.050419
C  2.098297 -0.187266 -0.497807
C  0.225053 -2.167706 1.300462
C  2.230263 -3.361453 0.779031
C  1.760372 1.796708 0.73252
C  0.052445 -2.940718 2.436724
C  2.073843 -4.146184 1.913252
C  1.081058 2.730869 -0.239108
C  0.981709 -3.926081 2.734219
C  -0.295719 2.64195 -0.415368
C  1.829002 3.664296 -0.939668
C  -0.918605 3.503521 -1.305691
C  1.302592 2.05594 2.098086
C  1.187155 4.529751 -1.815436
C  -0.182019 4.450831 -2.00714
C  -2.956796 2.308094 -1.463578
C  -2.518157 1.20768 -2.188551
C  -4.130191 2.254956 -0.727407
C  -3.261108 0.036797 -2.15807
C  -4.872865 1.08141 -0.718969
C  -4.439374 -0.032354 -1.425144
H  2.274278 -2.0547 -1.414117
H  -0.520207 -0.88813 -1.084431
H  0.751397 0.458385 -2.716186
H  1.358723 -1.007374 -3.492657
H  -0.350025 -0.596836 -3.580573
H  -1.177793 -2.683695 -2.662355
H  -0.542194 -3.384093 -1.180986
H  0.459608 -3.335992 -2.632383
H  -0.517203 -1.412859 1.07667
H  3.081677 -3.538853 0.133511
H  2.843379 1.950348 0.716439
H  -0.801276 -2.775679 3.079852
H  2.794817 -4.918895 2.143644
H  -0.874186 1.916906 0.145822
H  2.90056 3.720284 -0.798844
H  1.760324 5.264139 -2.364855
H  -0.68176 5.120186 -2.695517
H  -1.610219 1.261289 -2.775582
H  -4.461632 3.122502 -0.171032
H  -2.916478 -0.823605 -2.718078
H  -5.791115 1.038967 -0.148071
H  -5.016871 -0.946833 -1.408291
elementType: Cl O N C H
totalener: -1706.64231073 hartree
nucrepener: 2986.33480744 hartree
electener: -4692.97711817 hartree
oneelecener: -8266.44835585 hartree
twoeener: 3573.47123768 hartree
cpcmener: -0.03929088 hartree
kineticenergy: 1700.51882295 hartree
xcener: -142.756189455073 hartree
chargesum: -0.0000000
charge: -0.101526 -0.262407 -0.438430 -0.341593 -0.096153 0.180493 0.042169 -0.004728 -0.342289 -0.297626 0.343255 -0.248051 -0.190611 0.389933 -0.143889 -0.150272 0.052195 0.097331 -0.220242 -0.208053 0.250102 -0.225208 -0.111236 -0.236307 0.279244 -0.218023 -0.242088 -0.135670 -0.121619 -0.197062 0.092944 0.040331 0.096478 0.116400 0.098650 0.096297 0.100717 0.098261 0.145042 0.142392 0.143419 0.143160 0.144230 0.152164 0.150273 0.162973 0.151214 0.180852 0.149340 0.171702 0.161505 0.160019
qa: -0.1015 -0.2624 -0.4384 -0.3416 -0.0962 0.1805 0.0422 -0.0047 -0.3423 -0.2976 0.3433 -0.2481 -0.1906 0.3899 -0.1439 -0.1503 0.0522 0.0973 -0.2202 -0.2081 0.2501 -0.2252 -0.1112 -0.2363 0.2792 -0.2180 -0.2421 -0.1357 -0.1216 -0.1971 0.0929 0.0403 0.0965 0.1164 0.0986 0.0963 0.1007 0.0983 0.1450 0.1424 0.1434 0.1432 0.1442 0.1522 0.1503 0.1630 0.1512 0.1809 0.1493 0.1717 0.1615 0.1600
va: 1.2034 2.1367 2.0625 2.0701 3.1087 3.6254 3.8041 3.5557 3.9450 3.9232 4.2267 3.9872 4.0046 3.7521 4.0085 3.9797 3.5694 3.8163 3.9115 3.9669 3.7570 4.0832 3.8923 4.0138 3.7123 3.9033 4.0056 3.8437 3.8759 3.9296 1.0358 1.0261 0.9997 1.0085 0.9964 1.0084 1.0010 1.0012 1.0050 1.0035 1.0176 1.0063 1.0057 1.0115 1.0025 0.9876 1.0042 0.9831 1.0059 0.9836 0.9871 0.9911
dispcorr: -0.032119405 hartree
energy: -1706.674430134682
dipole: -7.73307 7.49637 -0.23670 2.23653 -2.64674 -0.41021 -28.72654 26.42942 -2.29711
magnitude: 2.34543 au
magnitude: 5.96161 debye
