program: Orca
programVersion: 5.0.2
elementType: Cl O O O N C C C C C C C C C C C C C C C C C C C C C C C C C H H H H H H H H H H H H H H H H H H H H H H
charge: 0
multiplicity: 1
keywords: wb97x-d3
keywords: def2-TZVPP
keywords: def2/J RIJCOSX
keywords: DEFGRID2
keywords: scfconv7
keywords: smallprint printgap noloewdin
keywords: NOSOSCF
formula: C25H22ClNO3
InChI: InChI=1/C25H22ClNO3/c1-17(2)24(18-11-13-20(26)14-12-18)25(28)30-23(16-27)19-7-6-10-22(15-19)29-21-8-4-3-5-9-21/h3-15,17,23-24H,1-2H3
52 atoms
Cl -3.263617 -3.130468 -1.226125
O  2.391704 0.716168 0.858069
O  3.033007 0.064772 -1.178403
O  -2.248988 1.91682 -0.88456
N  2.648562 3.494589 2.639485
C  2.323284 -1.599182 0.429266
C  3.346442 -2.640007 -0.060258
C  0.903378 -1.916162 0.004334
C  4.739691 -2.309727 0.463563
C  2.937256 -4.03599 0.391665
C  2.646795 -0.214648 -0.074109
C  0.551194 -1.987594 -1.341105
C  -0.067666 -2.187936 0.962092
C  2.50648 2.069974 0.453012
C  -0.73101 -2.347688 -1.723969
C  -1.354705 -2.554033 0.596186
C  1.324961 2.549454 -0.363577
C  -1.67189 -2.63954 -0.748995
C  0.081682 1.947076 -0.222868
C  1.500124 3.637169 -1.207295
C  -0.998493 2.463714 -0.927686
C  2.585344 2.84258 1.694156
C  0.412787 4.133218 -1.910585
C  -0.838646 3.55689 -1.769839
C  -2.720022 1.260837 0.225892
C  -3.577918 0.196778 -0.009906
C  -2.427284 1.662627 1.52374
C  -4.143721 -0.475896 1.063025
C  -2.985833 0.967504 2.58699
C  -3.84242 -0.102567 2.364907
H  2.352362 -1.582727 1.522233
H  3.366289 -2.622253 -1.154007
H  5.46434 -3.044432 0.110778
H  5.093961 -1.329837 0.140333
H  4.758331 -2.326964 1.555536
H  3.683223 -4.767355 0.078214
H  1.980723 -4.345719 -0.029107
H  2.858733 -4.090267 1.480066
H  1.280744 -1.780448 -2.113426
H  0.183721 -2.132187 2.013809
H  3.438015 2.244389 -0.096079
H  -0.985893 -2.408367 -2.773252
H  -2.093291 -2.77519 1.354226
H  -0.046173 1.089797 0.425573
H  2.476082 4.093695 -1.31286
H  0.538603 4.979391 -2.572306
H  -1.689222 3.944993 -2.315347
H  -3.801899 -0.098753 -1.026709
H  -1.774689 2.504343 1.715751
H  -4.810702 -1.306728 0.875993
H  -2.75054 1.274028 3.59764
H  -4.273771 -0.637969 3.200004
elementType: Cl O N C H
totalener: -1706.64336685 hartree
nucrepener: 3069.89651923 hartree
electener: -4776.53988608 hartree
oneelecener: -8434.42644309 hartree
twoeener: 3657.88655701 hartree
cpcmener: -0.03630550 hartree
kineticenergy: 1700.52886797 hartree
xcener: -142.761918017113 hartree
chargesum: -0.0000000
charge: -0.099997 -0.286038 -0.445243 -0.333408 -0.098967 0.161242 0.061821 -0.060124 -0.293059 -0.314872 0.353251 -0.175680 -0.155923 0.391067 -0.175933 -0.193563 0.051928 0.144178 -0.265186 -0.239485 0.347259 -0.224746 -0.093892 -0.266178 0.312843 -0.224877 -0.211427 -0.150944 -0.158613 -0.168290 0.090620 0.050149 0.094610 0.094287 0.090775 0.099610 0.096792 0.091655 0.141570 0.140454 0.152201 0.143759 0.145383 0.147019 0.148473 0.162740 0.148805 0.141112 0.160863 0.150189 0.161674 0.160116
qa: -0.1000 -0.2860 -0.4452 -0.3334 -0.0990 0.1612 0.0618 -0.0601 -0.2931 -0.3149 0.3533 -0.1757 -0.1559 0.3911 -0.1759 -0.1936 0.0519 0.1442 -0.2652 -0.2395 0.3473 -0.2247 -0.0939 -0.2662 0.3128 -0.2249 -0.2114 -0.1509 -0.1586 -0.1683 0.0906 0.0501 0.0946 0.0943 0.0908 0.0996 0.0968 0.0917 0.1416 0.1405 0.1522 0.1438 0.1454 0.1470 0.1485 0.1627 0.1488 0.1411 0.1609 0.1502 0.1617 0.1601
va: 1.2091 2.1378 2.0481 2.0824 3.1112 3.6804 3.8075 3.4899 3.9280 3.9506 4.1882 3.9596 3.9346 3.7207 4.0512 3.9649 3.6086 3.7640 3.9642 3.9999 3.6492 4.0822 3.8673 4.0162 3.6684 3.9015 3.8911 3.8218 3.8895 3.8789 1.0424 1.0270 1.0040 1.0115 1.0022 1.0044 1.0001 1.0018 1.0199 1.0050 1.0155 1.0074 1.0067 1.0096 1.0014 0.9872 1.0066 1.0173 0.9951 1.0039 0.9893 0.9891
dispcorr: -0.033358167 hartree
energy: -1706.676725021581
dipole: 19.04420 -18.53143 0.51277 -9.61122 8.61065 -1.00058 5.67330 -5.78702 -0.11371
magnitude: 1.13005 au
magnitude: 2.87237 debye
