program: Orca
programVersion: 5.0.2
elementType: Cl O O O N C C C C C C C C C C C C C C C C C C C C C C C C C H H H H H H H H H H H H H H H H H H H H H H
charge: 0
multiplicity: 1
keywords: wb97x-d3
keywords: def2-TZVPP
keywords: def2/J RIJCOSX
keywords: DEFGRID2
keywords: scfconv7
keywords: smallprint printgap noloewdin
keywords: NOSOSCF
formula: C25H22ClNO3
InChI: InChI=1/C25H22ClNO3/c1-17(2)24(18-11-13-20(26)14-12-18)25(28)30-23(16-27)19-7-6-10-22(15-19)29-21-8-4-3-5-9-21/h3-15,17,23-24H,1-2H3
52 atoms
Cl -3.19596 -4.286837 -0.608157
O  2.451449 0.859196 0.700139
O  1.8828 0.14099 -1.33857
O  -2.163405 2.897306 0.881084
N  4.146758 3.372957 1.978253
C  1.995405 -1.439485 0.490079
C  3.223728 -2.294782 0.089909
C  0.678163 -2.105944 0.171999
C  4.532783 -1.568075 0.380454
C  3.182047 -3.625203 0.829159
C  2.08405 -0.089501 -0.17559
C  0.391406 -2.616111 -1.09195
C  -0.268469 -2.259726 1.179418
C  2.65841 2.167581 0.198554
C  -0.798625 -3.283464 -1.337682
C  -1.464488 -2.92417 0.951438
C  1.376453 2.948235 -0.006028
C  -1.714319 -3.438196 -0.308865
C  0.179882 2.523642 0.547833
C  1.434243 4.127487 -0.74161
C  -0.965768 3.278629 0.330088
C  3.490971 2.830771 1.204516
C  0.287775 4.882784 -0.920987
C  -0.924478 4.456349 -0.395931
C  -2.704328 1.682897 0.5439
C  -3.650556 1.169504 1.421924
C  -2.381044 1.004717 -0.626099
C  -4.289473 -0.022184 1.115789
C  -3.025634 -0.191013 -0.913306
C  -3.983521 -0.707568 -0.0523
H  2.045704 -1.286898 1.571109
H  3.171115 -2.488737 -0.985576
H  4.666128 -0.673686 -0.230804
H  4.600947 -1.274924 1.430089
H  5.378124 -2.222963 0.166458
H  3.196392 -3.471243 1.910716
H  4.051726 -4.229785 0.568588
H  2.293285 -4.208425 0.586727
H  1.104026 -2.521466 -1.900898
H  -0.067955 -1.867333 2.168757
H  3.232135 2.146991 -0.734983
H  -1.001998 -3.683799 -2.321647
H  -2.184994 -3.037351 1.749877
H  0.11753 1.61937 1.14101
H  2.373643 4.454142 -1.170721
H  0.331372 5.802214 -1.489096
H  -1.827695 5.032662 -0.548907
H  -3.888803 1.704705 2.332561
H  -1.647319 1.396357 -1.318686
H  -5.028699 -0.417436 1.800312
H  -2.773999 -0.717418 -1.824981
H  -4.481936 -1.638273 -0.28528
elementType: Cl O N C H
totalener: -1706.64304335 hartree
nucrepener: 3025.52700045 hartree
electener: -4732.17004380 hartree
oneelecener: -8345.57709551 hartree
twoeener: 3613.40705170 hartree
cpcmener: -0.03903632 hartree
kineticenergy: 1700.51559426 hartree
xcener: -142.757145343968 hartree
chargesum: 0.0000000
charge: -0.101385 -0.283764 -0.443751 -0.340401 -0.097331 0.146523 0.057768 0.005670 -0.303075 -0.305705 0.343893 -0.190968 -0.185932 0.400347 -0.190341 -0.149956 0.037286 0.109026 -0.173964 -0.218395 0.215761 -0.222412 -0.124679 -0.201028 0.315500 -0.257232 -0.195310 -0.126316 -0.156099 -0.199487 0.083850 0.065522 0.092825 0.095202 0.095894 0.092467 0.098473 0.098482 0.144317 0.140640 0.150249 0.144410 0.141252 0.152007 0.151542 0.163120 0.151594 0.147370 0.151165 0.159508 0.160706 0.155160
qa: -0.1014 -0.2838 -0.4438 -0.3404 -0.0973 0.1465 0.0578 0.0057 -0.3031 -0.3057 0.3439 -0.1910 -0.1859 0.4003 -0.1903 -0.1500 0.0373 0.1090 -0.1740 -0.2184 0.2158 -0.2224 -0.1247 -0.2010 0.3155 -0.2572 -0.1953 -0.1263 -0.1561 -0.1995 0.0839 0.0655 0.0928 0.0952 0.0959 0.0925 0.0985 0.0985 0.1443 0.1406 0.1502 0.1444 0.1413 0.1520 0.1515 0.1631 0.1516 0.1474 0.1512 0.1595 0.1607 0.1552
va: 1.2046 2.1123 2.0527 2.0648 3.1132 3.6868 3.8146 3.5211 3.9483 3.9332 4.1630 3.9984 3.9522 3.7102 4.0182 3.9120 3.6252 3.7515 3.9737 3.9853 3.7723 4.0642 3.8855 4.0061 3.6523 4.0031 3.8603 3.9013 3.8474 3.8392 1.0461 1.0198 1.0077 1.0028 1.0048 1.0015 1.0054 1.0007 1.0151 1.0042 1.0159 1.0071 1.0088 1.0121 1.0002 0.9879 1.0015 1.0080 1.0050 0.9890 0.9915 1.0058
dispcorr: -0.032796481 hartree
energy: -1706.675839827981
dipole: 17.83136 -17.44759 0.38378 -5.04080 4.28226 -0.75854 1.10369 -1.74611 -0.64242
magnitude: 1.06554 au
magnitude: 2.70839 debye
