program: Orca
programVersion: 5.0.2
elementType: Cl O O O N C C C C C C C C C C C C C C C C C C C C C C C C C H H H H H H H H H H H H H H H H H H H H H H
charge: 0
multiplicity: 1
keywords: wb97x-d3
keywords: def2-TZVPP
keywords: def2/J RIJCOSX
keywords: DEFGRID2
keywords: scfconv7
keywords: smallprint printgap noloewdin
keywords: NOSOSCF
formula: C25H22ClNO3
InChI: InChI=1/C25H22ClNO3/c1-17(2)24(18-11-13-20(26)14-12-18)25(28)30-23(16-27)19-7-6-10-22(15-19)29-21-8-4-3-5-9-21/h3-15,17,23-24H,1-2H3
52 atoms
Cl -2.493535 -1.528946 2.79996
O  2.718691 0.704749 -0.392567
O  2.014765 -0.34237 -2.249016
O  -2.62958 1.155348 0.513286
N  3.850018 3.81629 -0.576821
C  2.665382 -1.637032 -0.31041
C  2.988649 -2.871351 -1.157107
C  1.380613 -1.706135 0.497466
C  4.321126 -2.684995 -1.875628
C  3.035947 -4.117216 -0.281151
C  2.453877 -0.387071 -1.131008
C  0.192463 -2.148394 -0.077905
C  1.34833 -1.212519 1.797589
C  2.054911 1.925791 -0.724477
C  -0.998802 -2.113529 0.629761
C  0.163117 -1.159578 2.515583
C  0.907114 2.105985 0.237038
C  -1.00376 -1.608414 1.920091
C  -0.332219 1.592038 -0.132233
C  1.101078 2.654747 1.497059
C  -1.38892 1.654631 0.766222
C  3.058798 2.983679 -0.631022
C  0.03693 2.702192 2.386454
C  -1.205785 2.209978 2.028368
C  -3.074182 0.922391 -0.763767
C  -3.714743 -0.285884 -0.993303
C  -2.973299 1.87648 -1.768266
C  -4.254683 -0.544658 -2.245249
C  -3.506425 1.598925 -3.018829
C  -4.147325 0.391788 -3.263859
H  3.493202 -1.46393 0.383659
H  2.207115 -3.007678 -1.910133
H  4.32243 -1.824033 -2.545039
H  5.134411 -2.55038 -1.159081
H  4.556324 -3.562467 -2.479017
H  3.783001 -4.014075 0.508984
H  3.304431 -4.99057 -0.876397
H  2.077226 -4.328331 0.192505
H  0.179955 -2.525728 -1.09276
H  2.259392 -0.857982 2.262756
H  1.695267 1.913942 -1.756922
H  -1.911257 -2.468424 0.171539
H  0.154662 -0.766591 3.52312
H  -0.454868 1.147842 -1.112102
H  2.066496 3.045105 1.793159
H  0.175709 3.130711 3.369871
H  -2.035161 2.25062 2.722999
H  -3.80069 -1.01061 -0.193646
H  -2.491498 2.827993 -1.583902
H  -4.757861 -1.4859 -2.42142
H  -3.426561 2.339708 -3.803451
H  -4.563983 0.185451 -4.240632
elementType: Cl O N C H
totalener: -1706.64104588 hartree
nucrepener: 3107.56688790 hartree
electener: -4814.20793379 hartree
oneelecener: -8509.66674765 hartree
twoeener: 3695.45881386 hartree
cpcmener: -0.03604589 hartree
kineticenergy: 1700.53751723 hartree
xcener: -142.763471300002 hartree
chargesum: 0.0000000
charge: -0.099868 -0.277993 -0.437340 -0.321802 -0.099898 0.131806 0.061019 0.052702 -0.298274 -0.306535 0.342623 -0.214390 -0.247467 0.396307 -0.181946 -0.158684 -0.018220 0.139472 -0.211843 -0.210373 0.364346 -0.217213 -0.102694 -0.280688 0.331790 -0.267560 -0.223301 -0.121879 -0.136167 -0.191367 0.102768 0.044335 0.095463 0.090413 0.094197 0.091770 0.097054 0.099280 0.146903 0.140471 0.138025 0.151665 0.143143 0.145852 0.138235 0.160778 0.140813 0.139757 0.158771 0.161782 0.162468 0.161497
qa: -0.0999 -0.2780 -0.4373 -0.3218 -0.0999 0.1318 0.0610 0.0527 -0.2983 -0.3065 0.3426 -0.2144 -0.2475 0.3963 -0.1819 -0.1587 -0.0182 0.1395 -0.2118 -0.2104 0.3643 -0.2172 -0.1027 -0.2807 0.3318 -0.2676 -0.2233 -0.1219 -0.1362 -0.1914 0.1028 0.0443 0.0955 0.0904 0.0942 0.0918 0.0971 0.0993 0.1469 0.1405 0.1380 0.1517 0.1431 0.1459 0.1382 0.1608 0.1408 0.1398 0.1588 0.1618 0.1625 0.1615
va: 1.2101 2.1267 2.0553 2.0654 3.1082 3.6482 3.8125 3.4477 3.9309 3.9436 4.2421 3.9738 4.0163 3.7380 3.9577 3.9285 3.7180 3.7370 3.8602 3.9651 3.5299 4.0783 3.8817 4.0135 3.6157 3.9851 3.9324 3.9043 3.8746 3.9139 1.0333 1.0284 1.0116 1.0024 1.0038 1.0020 1.0045 1.0014 1.0087 1.0091 1.0258 0.9959 1.0078 1.0151 1.0106 0.9884 1.0138 1.0184 0.9977 0.9891 0.9886 0.9893
dispcorr: -0.035033794 hartree
energy: -1706.676079678284
dipole: 14.60232 -15.14349 -0.54117 -15.13194 13.82807 -1.30387 -13.29379 13.39252 0.09873
magnitude: 1.41516 au
magnitude: 3.59706 debye
