program: Orca
programVersion: 5.0.2
elementType: Cl O O O N C C C C C C C C C C C C C C C C C C C C C C C C C H H H H H H H H H H H H H H H H H H H H H H
charge: 0
multiplicity: 1
keywords: wb97x-d3
keywords: def2-TZVPP
keywords: def2/J RIJCOSX
keywords: DEFGRID2
keywords: scfconv7
keywords: smallprint printgap noloewdin
keywords: NOSOSCF
formula: C25H22ClNO3
InChI: InChI=1/C25H22ClNO3/c1-17(2)24(18-11-13-20(26)14-12-18)25(28)30-23(16-27)19-7-6-10-22(15-19)29-21-8-4-3-5-9-21/h3-15,17,23-24H,1-2H3
52 atoms
Cl -0.980032 -2.218656 4.059965
O  2.608175 0.840394 -0.563833
O  1.188721 0.10218 -2.128338
O  -2.935159 1.97564 0.124158
N  3.661104 3.803896 0.44897
C  2.468167 -1.489356 -0.826829
C  2.356612 -2.571454 -1.907043
C  1.607995 -1.73706 0.399064
C  3.301197 -2.271312 -3.065646
C  2.674204 -3.937628 -1.310447
C  2.026284 -0.124346 -1.295248
C  2.17655 -1.784286 1.665962
C  0.225647 -1.860714 0.281212
C  1.930686 2.09726 -0.506301
C  1.390546 -1.948629 2.797997
C  -0.574327 -2.021517 1.400241
C  0.716058 1.968442 0.379339
C  0.018198 -2.057809 2.652935
C  -0.546642 2.081803 -0.180851
C  0.869885 1.637057 1.722649
C  -1.662543 1.842509 0.612089
C  2.908684 3.038817 0.035283
C  -0.253057 1.417491 2.501621
C  -1.523258 1.506847 1.948985
C  -3.259763 1.452915 -1.102895
C  -4.224896 2.133025 -1.832665
C  -2.706862 0.272195 -1.583097
C  -4.644282 1.621517 -3.051932
C  -3.129068 -0.220669 -2.810171
C  -4.096026 0.446953 -3.549437
H  3.511425 -1.427245 -0.50292
H  1.33039 -2.590546 -2.285369
H  3.086421 -1.317671 -3.548602
H  4.338541 -2.246093 -2.725173
H  3.225846 -3.044976 -3.830634
H  2.666208 -4.703218 -2.086819
H  1.950782 -4.235486 -0.551289
H  3.66437 -3.94531 -0.849402
H  3.248943 -1.686755 1.779245
H  -0.247143 -1.831746 -0.692698
H  1.65423 2.453972 -1.502646
H  1.847815 -1.977197 3.777576
H  -1.647212 -2.105852 1.293118
H  -0.654623 2.347798 -1.225218
H  1.856456 1.542985 2.159275
H  -0.143555 1.154875 3.544999
H  -2.401195 1.320156 2.55379
H  -4.648402 3.050467 -1.444181
H  -1.963744 -0.268982 -1.011265
H  -5.400143 2.151179 -3.616714
H  -2.697986 -1.139934 -3.184448
H  -4.421001 0.053609 -4.503148
elementType: Cl O N C H
totalener: -1706.64288158 hartree
nucrepener: 3072.44084495 hartree
electener: -4779.08372652 hartree
oneelecener: -8439.10675827 hartree
twoeener: 3660.02303175 hartree
cpcmener: -0.03712446 hartree
kineticenergy: 1700.53618717 hartree
xcener: -142.761578121188 hartree
chargesum: -0.0000000
charge: -0.100538 -0.277022 -0.440197 -0.339779 -0.099636 0.134682 0.064571 0.001265 -0.295609 -0.312432 0.335161 -0.183611 -0.222941 0.414699 -0.146719 -0.179288 0.070085 0.127091 -0.207895 -0.282490 0.305049 -0.225020 -0.085659 -0.251575 0.266631 -0.229945 -0.144549 -0.139989 -0.194273 -0.167561 0.100327 0.045880 0.095333 0.090213 0.094104 0.097773 0.097625 0.092186 0.139712 0.156795 0.139323 0.141373 0.142741 0.148780 0.147516 0.155836 0.147094 0.147416 0.145733 0.161111 0.159802 0.160819
qa: -0.1005 -0.2770 -0.4402 -0.3398 -0.0996 0.1347 0.0646 0.0013 -0.2956 -0.3124 0.3352 -0.1836 -0.2229 0.4147 -0.1467 -0.1793 0.0701 0.1271 -0.2079 -0.2825 0.3050 -0.2250 -0.0857 -0.2516 0.2666 -0.2299 -0.1445 -0.1400 -0.1943 -0.1676 0.1003 0.0459 0.0953 0.0902 0.0941 0.0978 0.0976 0.0922 0.1397 0.1568 0.1393 0.1414 0.1427 0.1488 0.1475 0.1558 0.1471 0.1474 0.1457 0.1611 0.1598 0.1608
va: 1.2043 2.1507 2.0476 2.0718 3.1104 3.6633 3.8100 3.4353 3.9279 3.9491 4.2596 3.9708 3.9416 3.7317 3.9690 3.9681 3.5284 3.7596 3.9589 3.9672 3.6814 4.0834 3.8259 3.9980 3.7010 3.9747 3.8443 3.8946 3.9362 3.8794 1.0383 1.0270 1.0125 1.0017 1.0043 1.0048 1.0001 1.0017 1.0042 0.9999 1.0172 1.0069 1.0085 1.0094 1.0099 0.9929 1.0077 1.0079 0.9892 0.9881 0.9918 0.9891
dispcorr: -0.034553968 hartree
energy: -1706.677435544983
dipole: 8.30367 -8.41073 -0.10706 -14.10771 12.42459 -1.68311 -23.30180 22.58058 -0.72123
magnitude: 1.83426 au
magnitude: 4.66231 debye
