program: Gaussian 09
title: 000067469
version: EM64L-G09RevD.01
frameworkgroup: C1[X(C16H11NS)]
method: RPBEPBE
basis: SDD
operation: Freq
keyword: #p
keyword: freq=noraman
keyword: PBEPBE/SDD
title: #p freq=noraman PBEPBE/SDD
converged: NO YES NO NO
title: Mulliken charges:
elementType: S N C C C C C C C C C C C C C C C C H H H H H H H H H H H
charge: 0.200671 -0.518355 0.480776 0.198678 -0.391824 0.452888 0.559357 -0.303392 -0.312617 -0.494029 -0.350403 -0.429157 -0.418304 -0.278451 -0.274186 -0.245845 -0.214440 -0.256514 0.303637 0.238724 0.241718 0.190373 0.241440 0.221783 0.238188 0.228227 0.230455 0.228761 0.231841
chargesum: 0.00000
title: Mulliken charges with hydrogens summed into heavy atoms:
elementType: S N C C C C C C C C C C C C C C C C
charge: 0.200671 -0.214718 0.480776 0.198678 -0.391824 0.452888 0.559357 -0.303392 -0.073893 -0.252310 -0.160030 -0.187717 -0.196521 -0.040263 -0.045959 -0.015390 0.014321 -0.024674
polarizability: 3.49478966e+02 5.09949733e-01 2.20239359e+02 3.46137349e-03 1.08889766e-03 7.16852988e+01
1716.lowfreq: -37.0553 -0.0016 -0.0013 -0.0006 5.3128 11.8232 13.3145 61.0936 98.1191
frequency: -37.0417 61.0635 98.1160 149.7537 152.1535 219.1434 248.5955 281.2153 291.8880 320.2389 386.1715 413.3947 427.9183 436.4575 448.0680 473.6668 503.6944 519.6516 536.5909 574.0872 575.8259 613.7290 646.8344 661.4557 662.3970 712.3322 738.9409 749.0009 757.0883 788.8191 803.3211 817.0482 843.4856 864.5682 866.8933 890.6017 921.7382 939.5423 955.0162 964.3682 986.8603 1029.3463 1035.1409 1049.9198 1065.5004 1123.4443 1140.9004 1158.3743 1171.8224 1185.5599 1229.2610 1239.4197 1264.9237 1275.3867 1290.7244 1333.1552 1385.9431 1406.7326 1416.9531 1424.6069 1433.4474 1459.5387 1485.4048 1496.7197 1528.8352 1578.4178 1594.4277 1598.2850 1613.0837 1630.5584 3110.6266 3111.2267 3124.1318 3130.3818 3131.7895 3142.1990 3146.9791 3153.7081 3163.2224 3170.4675 3582.5446
redmass: 6.0852 4.3133 4.2462 4.4154 5.2603 4.7611 3.6584 6.3817 4.6857 6.8898 10.9910 2.7611 8.4368 2.8415 5.3975 1.4914 3.6059 6.9303 3.5757 7.6917 2.9761 7.6882 6.2806 4.3708 6.6642 2.9403 1.3377 1.3421 6.0937 2.8403 1.3589 5.9777 1.4473 5.7278 1.8107 5.1874 1.3845 1.3356 1.4077 1.3142 1.3561 4.0376 2.8373 3.0831 2.6203 1.7414 1.8294 1.3104 1.0587 1.1439 1.6519 2.0841 1.6158 1.8598 2.0975 2.6116 6.8987 2.0959 4.1674 3.5772 3.2450 2.3607 3.1723 2.5715 2.6552 7.2536 4.4980 5.4100 6.5791 6.1896 1.0869 1.0879 1.0877 1.0869 1.0882 1.0937 1.0922 1.0977 1.1003 1.1004 1.0749
irintensity: 0.0520 0.2177 0.7682 0.0654 0.4659 0.0228 8.5223 0.8962 2.6611 0.1481 0.0381 0.1919 0.9429 23.0646 7.7122 27.0372 1.1424 0.0412 0.5602 7.7451 27.7018 0.6992 0.4179 10.8108 5.6032 3.8582 14.5210 147.4582 6.4971 6.1003 62.6362 2.6561 4.3941 3.6946 16.0596 16.8036 3.0485 0.5436 3.3303 0.0801 0.8175 17.1191 10.9151 8.3006 6.8817 39.7120 16.2386 1.9360 0.6003 1.9848 0.0832 2.6312 4.0751 3.8048 20.5232 12.9847 41.9564 25.6642 23.3234 132.6451 33.1151 53.7363 385.6924 97.0129 179.1664 36.2030 3.7603 23.1116 17.1740 2.3937 16.6666 9.0683 1.2197 1.3103 1.0229 29.2312 16.2375 17.7888 34.9075 28.1089 18.2380
temp: 298.150 k
press: 1.00000 atm
elementType: 16 7 6 6 6 6 6 6 6 6 6 6 6 6 6 6 6 6 1 1 1 1 1 1 1 1 1 1 1
symmnumber: 1
zpe: 579679.5 jmol-1
zpe.correction: 0.220788 hartree
zpe.thermalcorrener: 0.233420 hartree
zpe.thermalcorrenthalpy: 0.234364 hartree
zpe.thermalcorrgfe: 0.181970 hartree
zpe.sumelectzpe: -1067.924507 hartree
zpe.sumelectthermal: -1067.911875 hartree
zpe.sumelectthermalent: -1067.910931 hartree
zpe.sumelectthermalfe: -1067.963325 hartree
dipole: 0.7159 -2.0439 0.0020
dipole: 2.1656
quadrupole: -95.7937 -97.0854 -121.0311
quadrupole: 2.4121 -0.0024 0.0091
quadrupole: 8.8430 7.5514 -16.3944 2.4121 -0.0024 0.0091
hfenergy: -1068.1452948 hartree
pointgroup: C01 [X(C16H11N1S1)]
dipole: 0.257834 0.8120805 -0.0007924 debye
polarizability: 349.3968609|3.2961433|220.3214646|-0.0034919|0.0009865|71.6852988 unknown
InChI: InChI=1S/C16H11NS/c1-2-6-12-11(5-1)9-10-15-16(12)17-13-7-3-4-8-14(13)18-15/h1-10,17H
charge 0 multiplicity 1
29 atoms
S  -1.587506 -2.197492 0.00222
N  -0.651535 0.850759 0.00187
C  0.378572 -0.108498 0.000974
C  1.756864 0.343597 0.000341
C  0.11121 -1.488865 0.000608
C  2.824348 -0.639586 -0.000653
C  -2.044839 0.628976 0.000771
C  -2.61594 -0.672334 0.000405
C  1.16872 -2.441622 -0.000502
C  2.501532 -2.03288 -0.001097
C  2.120593 1.73334 0.000719
C  4.186939 -0.194416 -0.001232
C  -2.914659 1.750178 -0.000061
C  -4.014358 -0.83511 -0.000877
C  3.458726 2.13573 0.000129
C  4.506758 1.163479 -0.000867
C  -4.316442 1.585326 -0.001174
C  -4.87455 0.289314 -0.001628
H  -0.367513 1.828398 0.002026
H  0.918794 -3.508519 -0.000823
H  3.308789 -2.772818 -0.001905
H  1.358067 2.521784 0.001543
H  4.980384 -0.951456 -0.001987
H  -2.482184 2.758968 0.000175
H  -4.436829 -1.846464 -0.001218
H  3.706807 3.202754 0.000449
H  5.55255 1.488721 -0.00134
H  -4.964736 2.467926 -0.001736
H  -5.959561 0.146409 -0.002533
