program: Orca
programVersion: 5.0.2
elementType: Cl O O O N C C C C C C C C C C C C C C C C C C C C C C C C C H H H H H H H H H H H H H H H H H H H H H H
charge: 0
multiplicity: 1
keywords: wb97x-d3
keywords: def2-TZVPP
keywords: def2/J RIJCOSX
keywords: DEFGRID2
keywords: scfconv7
keywords: smallprint printgap noloewdin
keywords: NOSOSCF
formula: C25H22ClNO3
InChI: InChI=1/C25H22ClNO3/c1-17(2)24(18-11-13-20(26)14-12-18)25(28)30-23(16-27)19-7-6-10-22(15-19)29-21-8-4-3-5-9-21/h3-15,17,23-24H,1-2H3
52 atoms
Cl -1.179181 -1.942418 4.124468
O  2.639358 0.790155 -0.52955
O  1.274595 -0.046825 -2.093139
O  -2.917356 1.973236 -0.06427
N  3.679254 3.796429 0.340078
C  2.491793 -1.551601 -0.637246
C  2.429658 -2.701705 -1.648454
C  1.574907 -1.718023 0.560841
C  3.432627 -2.476207 -2.774338
C  2.715283 -4.025253 -0.949306
C  2.077338 -0.219691 -1.214224
C  2.083857 -1.669586 1.852808
C  0.19989 -1.859805 0.388108
C  1.965273 2.049738 -0.571587
C  1.246358 -1.756333 2.956014
C  -0.651308 -1.943242 1.477884
C  0.725888 1.978174 0.286492
C  -0.117677 -1.883254 2.756225
C  -0.5215 2.056648 -0.312797
C  0.843229 1.732332 1.651597
C  -1.658606 1.87019 0.464342
C  2.930023 3.018521 -0.054635
C  -0.300268 1.563617 2.413162
C  -1.555448 1.619184 1.823126
C  -3.203461 1.391943 -1.274819
C  -2.659038 0.174398 -1.664986
C  -4.120317 2.050963 -2.081677
C  -3.042044 -0.377617 -2.879557
C  -4.500304 1.481335 -3.288207
C  -3.960792 0.268549 -3.69571
H  3.518679 -1.46828 -0.268711
H  1.42367 -2.746181 -2.07606
H  4.451774 -2.433417 -2.383379
H  3.390788 -3.294638 -3.494102
H  3.248764 -1.552772 -3.324747
H  3.68669 -4.003975 -0.4497
H  2.734798 -4.841239 -1.672735
H  1.960855 -4.270111 -0.201352
H  3.149463 -1.555959 2.007655
H  -0.226734 -1.904996 -0.60647
H  1.719459 2.344889 -1.595895
H  1.657113 -1.710952 3.95542
H  -1.717622 -2.043401 1.326631
H  -0.601208 2.255943 -1.37445
H  1.817276 1.66724 2.12061
H  -0.218518 1.366817 3.473486
H  -2.449353 1.471739 2.415334
H  -1.952015 -0.348871 -1.033348
H  -4.537103 2.998076 -1.763185
H  -2.619072 -1.3263 -3.183159
H  -5.218172 1.995286 -3.913805
H  -4.255533 -0.170729 -4.639208
elementType: Cl O N C H
totalener: -1706.64256564 hartree
nucrepener: 3074.70399689 hartree
electener: -4781.34656253 hartree
oneelecener: -8443.65742952 hartree
twoeener: 3662.31086699 hartree
cpcmener: -0.03714204 hartree
kineticenergy: 1700.52940389 hartree
xcener: -142.760197729579 hartree
chargesum: 0.0000000
charge: -0.100618 -0.276839 -0.439723 -0.340632 -0.099182 0.131803 0.067335 0.004663 -0.295849 -0.312527 0.334804 -0.180551 -0.225862 0.411924 -0.149311 -0.178844 0.068821 0.128823 -0.204770 -0.282853 0.301377 -0.224639 -0.085327 -0.249937 0.262340 -0.141506 -0.227872 -0.194925 -0.141046 -0.167329 0.099493 0.045726 0.090362 0.094525 0.094699 0.091867 0.097887 0.097491 0.139914 0.156530 0.139101 0.141135 0.142705 0.148660 0.147550 0.155893 0.146772 0.147203 0.147787 0.160140 0.161510 0.161300
qa: -0.1006 -0.2768 -0.4397 -0.3406 -0.0992 0.1318 0.0673 0.0047 -0.2958 -0.3125 0.3348 -0.1806 -0.2259 0.4119 -0.1493 -0.1788 0.0688 0.1288 -0.2048 -0.2829 0.3014 -0.2246 -0.0853 -0.2499 0.2623 -0.1415 -0.2279 -0.1949 -0.1410 -0.1673 0.0995 0.0457 0.0904 0.0945 0.0947 0.0919 0.0979 0.0975 0.1399 0.1565 0.1391 0.1411 0.1427 0.1487 0.1475 0.1559 0.1468 0.1472 0.1478 0.1601 0.1615 0.1613
va: 1.2043 2.1499 2.0479 2.0709 3.1098 3.6647 3.8068 3.4332 3.9284 3.9494 4.2605 3.9688 3.9433 3.7391 3.9664 3.9668 3.5286 3.7582 3.9532 3.9675 3.6842 4.0834 3.8276 3.9920 3.7006 3.8472 3.9761 3.9385 3.8959 3.8801 1.0387 1.0271 1.0016 1.0042 1.0125 1.0017 1.0046 1.0003 1.0039 1.0002 1.0171 1.0070 1.0085 1.0094 1.0097 0.9929 1.0081 0.9873 1.0077 0.9917 0.9880 0.9890
dispcorr: -0.034641529 hartree
energy: -1706.677207169468
dipole: 9.29966 -9.39739 -0.09773 -15.55148 13.83822 -1.71326 -21.87381 21.25728 -0.61653
magnitude: 1.82344 au
magnitude: 4.63481 debye
