program: Orca
programVersion: 5.0.2
elementType: Cl O O O N C C C C C C C C C C C C C C C C C C C C C C C C C H H H H H H H H H H H H H H H H H H H H H H
charge: 0
multiplicity: 1
keywords: wb97x-d3
keywords: def2-TZVPP
keywords: def2/J RIJCOSX
keywords: DEFGRID2
keywords: scfconv7
keywords: smallprint printgap noloewdin
keywords: NOSOSCF
formula: C25H22ClNO3
InChI: InChI=1/C25H22ClNO3/c1-17(2)24(18-11-13-20(26)14-12-18)25(28)30-23(16-27)19-7-6-10-22(15-19)29-21-8-4-3-5-9-21/h3-15,17,23-24H,1-2H3
52 atoms
Cl -2.507769 -2.947716 2.611991
O  2.431526 0.618703 0.488475
O  2.866299 0.419472 -1.691702
O  -2.370366 2.332517 0.22465
N  3.033174 2.866895 2.818446
C  2.573735 -1.573827 -0.323631
C  2.87523 -2.461807 -1.547954
C  1.295015 -1.915826 0.405288
C  3.206554 -3.87743 -1.088435
C  1.777837 -2.499654 -2.604306
C  2.633094 -0.09397 -0.632742
C  0.051832 -1.528074 -0.090105
C  1.335408 -2.636959 1.59383
C  2.517467 2.029963 0.396521
C  -1.11862 -1.847742 0.578679
C  0.17411 -2.965552 2.278564
C  1.243006 2.676187 -0.097259
C  -1.046395 -2.562902 1.763158
C  0.0059 2.162193 0.269526
C  1.324666 3.827528 -0.870037
C  -1.143552 2.810056 -0.156615
C  2.807035 2.482274 1.760214
C  0.164717 4.47325 -1.270909
C  -1.077173 3.964656 -0.921281
C  -2.89844 1.259138 -0.432345
C  -3.995276 0.651334 0.17006
C  -2.408743 0.78667 -1.644004
C  -4.602141 -0.430666 -0.446353
C  -3.026625 -0.303005 -2.245876
C  -4.120629 -0.91744 -1.65598
H  3.398396 -1.731409 0.383246
H  3.777036 -2.049054 -2.010247
H  4.025707 -3.888509 -0.366594
H  2.346686 -4.36566 -0.625013
H  3.51017 -4.492028 -1.937454
H  0.884525 -3.011516 -2.242613
H  2.130838 -3.051902 -3.477122
H  1.482125 -1.508859 -2.949577
H  -0.021846 -0.958215 -1.008485
H  2.289314 -2.944851 2.004532
H  3.35883 2.337455 -0.23423
H  -2.074543 -1.537785 0.179009
H  0.228746 -3.522224 3.204541
H  -0.076303 1.274577 0.886427
H  2.292283 4.22329 -1.15279
H  0.227064 5.373487 -1.86822
H  -1.987366 4.459202 -1.23659
H  -4.366923 1.02762 1.11518
H  -1.559565 1.251353 -2.128267
H  -5.453961 -0.900729 0.028167
H  -2.640427 -0.669796 -3.18839
H  -4.593113 -1.766757 -2.131377
elementType: Cl O N C H
totalener: -1706.65538178 hartree
nucrepener: 3056.30101222 hartree
electener: -4762.95639400 hartree
oneelecener: -8406.87672657 hartree
twoeener: 3643.92033257 hartree
cpcmener: -0.03240625 hartree
kineticenergy: 1700.52964381 hartree
xcener: -142.759931453056 hartree
chargesum: -0.0000000
charge: -0.093273 -0.280491 -0.415137 -0.327660 -0.085297 0.107356 0.082953 0.129543 -0.324874 -0.318303 0.350256 -0.393471 -0.219955 0.368602 -0.014595 -0.107687 0.035779 0.011629 -0.184755 -0.175677 0.185347 -0.228303 -0.131497 -0.165429 0.317648 -0.247895 -0.228821 -0.110119 -0.142375 -0.188496 0.100356 0.046152 0.097420 0.089055 0.101657 0.087740 0.105629 0.094375 0.171688 0.141190 0.145191 0.100389 0.140712 0.161980 0.145800 0.160447 0.151076 0.142277 0.147686 0.153228 0.156909 0.154039
qa: -0.0933 -0.2805 -0.4151 -0.3277 -0.0853 0.1074 0.0830 0.1295 -0.3249 -0.3183 0.3503 -0.3935 -0.2200 0.3686 -0.0146 -0.1077 0.0358 0.0116 -0.1848 -0.1757 0.1853 -0.2283 -0.1315 -0.1654 0.3176 -0.2479 -0.2288 -0.1101 -0.1424 -0.1885 0.1004 0.0462 0.0974 0.0891 0.1017 0.0877 0.1056 0.0944 0.1717 0.1412 0.1452 0.1004 0.1407 0.1620 0.1458 0.1604 0.1511 0.1423 0.1477 0.1532 0.1569 0.1540
va: 1.2187 2.1280 2.0863 2.0764 3.1136 3.7766 3.8379 3.4411 3.9443 3.9371 4.2321 3.9658 4.0025 3.7582 3.8238 3.9433 3.6012 3.9714 4.0094 3.9632 3.8045 4.0815 3.8849 3.9809 3.6410 3.9693 3.8244 3.8633 3.8673 3.8670 1.0288 1.0242 1.0021 0.9996 1.0044 0.9969 1.0059 1.0156 0.9776 1.0018 1.0183 1.0094 1.0051 0.9939 1.0008 0.9893 1.0001 1.0104 1.0070 0.9910 0.9924 0.9924
dispcorr: -0.033274922 hartree
energy: -1706.688656696675
dipole: 10.61097 -10.09432 0.51666 -11.00358 10.37527 -0.62831 -21.82448 19.97094 -1.85354
magnitude: 2.02419 au
magnitude: 5.14507 debye
