program: Orca
programVersion: 5.0.2
elementType: Cl O O O N C C C C C C C C C C C C C C C C C C C C C C C C C H H H H H H H H H H H H H H H H H H H H H H
charge: 0
multiplicity: 1
keywords: wb97x-d3
keywords: def2-TZVPP
keywords: def2/J RIJCOSX
keywords: DEFGRID2
keywords: scfconv7
keywords: smallprint printgap noloewdin
keywords: NOSOSCF
formula: C25H22ClNO3
InChI: InChI=1/C25H22ClNO3/c1-17(2)24(18-11-13-20(26)14-12-18)25(28)30-23(16-27)19-7-6-10-22(15-19)29-21-8-4-3-5-9-21/h3-15,17,23-24H,1-2H3
52 atoms
Cl 0.683393 -3.22682 4.452367
O  2.233702 0.865742 -0.41979
O  0.92117 0.309962 -2.139905
O  -3.290698 2.127705 -0.036762
N  3.351711 3.733858 0.781542
C  2.28979 -1.385916 -1.061462
C  1.975721 -2.382474 -2.197298
C  1.873403 -1.85023 0.31785
C  2.907722 -3.584913 -2.097714
C  0.528072 -2.854184 -2.263291
C  1.722409 -0.0067 -1.303596
C  0.555847 -1.73685 0.757518
C  2.811685 -2.403443 1.183297
C  1.605438 2.143221 -0.331656
C  0.181949 -2.16081 2.022945
C  2.45514 -2.837105 2.451697
C  0.333592 2.026398 0.470989
C  1.138745 -2.707933 2.862681
C  -0.882795 2.202574 -0.171191
C  0.383989 1.638578 1.805104
C  -2.060853 1.96084 0.52489
C  2.590783 3.019682 0.302581
C  -0.799566 1.426741 2.493021
C  -2.023155 1.5726 1.856794
C  -3.492265 1.874146 -1.368029
C  -4.318666 2.750987 -2.055883
C  -2.953157 0.760555 -2.002172
C  -4.60917 2.509873 -3.391166
C  -3.242309 0.539628 -3.340943
C  -4.067823 1.409538 -4.041334
H  3.378138 -1.256993 -1.043408
H  2.207595 -1.864076 -3.133118
H  2.749536 -4.260621 -2.939787
H  3.958132 -3.28713 -2.108632
H  2.732503 -4.157683 -1.184506
H  -0.187593 -2.035082 -2.321082
H  0.264308 -3.47292 -1.403781
H  0.385924 -3.467824 -3.154679
H  -0.205557 -1.304818 0.118892
H  3.844785 -2.4941 0.870611
H  1.401604 2.556337 -1.324491
H  -0.844844 -2.05557 2.346745
H  3.201256 -3.261398 3.110117
H  -0.903559 2.51407 -1.207866
H  1.333195 1.491762 2.305949
H  -0.772676 1.124865 3.531612
H  -2.946978 1.388953 2.390972
H  -4.734167 3.611825 -1.54682
H  -2.318237 0.066327 -1.465528
H  -5.25651 3.193763 -3.925073
H  -2.819966 -0.325762 -3.835682
H  -4.289873 1.228813 -5.084814
elementType: Cl O N C H
totalener: -1706.65451205 hartree
nucrepener: 3001.17342014 hartree
electener: -4707.82793219 hartree
oneelecener: -8296.43282734 hartree
twoeener: 3588.60489515 hartree
cpcmener: -0.03150141 hartree
kineticenergy: 1700.53329398 hartree
xcener: -142.758744441984 hartree
chargesum: -0.0000000
charge: -0.097221 -0.270158 -0.414028 -0.325933 -0.086385 0.106424 0.086583 0.060256 -0.324564 -0.317132 0.338991 -0.266278 -0.206696 0.394334 -0.162398 -0.135795 0.028652 0.095607 -0.187160 -0.227906 0.287573 -0.230358 -0.145411 -0.213431 0.257637 -0.228477 -0.176732 -0.134104 -0.171435 -0.163689 0.101396 0.050113 0.100526 0.096775 0.088687 0.091526 0.086494 0.105908 0.157134 0.144649 0.135381 0.141023 0.142768 0.144289 0.144078 0.158131 0.147888 0.145702 0.174824 0.157630 0.156679 0.157634
qa: -0.0972 -0.2702 -0.4140 -0.3259 -0.0864 0.1064 0.0866 0.0603 -0.3246 -0.3171 0.3390 -0.2663 -0.2067 0.3943 -0.1624 -0.1358 0.0287 0.0956 -0.1872 -0.2279 0.2876 -0.2304 -0.1454 -0.2134 0.2576 -0.2285 -0.1767 -0.1341 -0.1714 -0.1637 0.1014 0.0501 0.1005 0.0968 0.0887 0.0915 0.0865 0.1059 0.1571 0.1446 0.1354 0.1410 0.1428 0.1443 0.1441 0.1581 0.1479 0.1457 0.1748 0.1576 0.1567 0.1576
va: 1.2087 2.1396 2.0795 2.0925 3.1125 3.7261 3.8200 3.4315 3.9439 3.9493 4.2580 3.9259 3.9827 3.7605 3.9877 3.9828 3.5668 3.8513 3.9269 3.9290 3.7416 4.0773 3.8930 3.9970 3.7359 3.9919 3.8877 3.8925 3.9148 3.8934 1.0318 1.0221 1.0049 1.0023 0.9999 1.0129 0.9971 1.0052 0.9818 0.9995 1.0181 1.0095 1.0049 1.0109 1.0094 0.9905 1.0048 1.0079 0.9733 0.9893 0.9928 0.9905
dispcorr: -0.032054190 hartree
energy: -1706.686566235493
dipole: -1.10239 0.72170 -0.38069 -10.56627 9.27608 -1.29020 -25.85749 24.64947 -1.20802
magnitude: 1.80800 au
magnitude: 4.59556 debye
