program: Orca
programVersion: 5.0.2
elementType: Cl O O O N C C C C C C C C C C C C C C C C C C C C C C C C C H H H H H H H H H H H H H H H H H H H H H H
charge: 0
multiplicity: 1
keywords: wb97x-d3
keywords: def2-TZVPP
keywords: def2/J RIJCOSX
keywords: DEFGRID2
keywords: scfconv7
keywords: smallprint printgap noloewdin
keywords: NOSOSCF
formula: C25H22ClNO3
InChI: InChI=1/C25H22ClNO3/c1-17(2)24(18-11-13-20(26)14-12-18)25(28)30-23(16-27)19-7-6-10-22(15-19)29-21-8-4-3-5-9-21/h3-15,17,23-24H,1-2H3
52 atoms
Cl -2.174554 -3.165305 3.086813
O  2.316143 0.608659 0.52583
O  2.789463 0.537209 -1.650909
O  -2.388354 2.518699 -0.194828
N  2.620336 2.742506 3.014069
C  2.438376 -1.535614 -0.432673
C  2.507408 -2.313825 -1.763232
C  1.28111 -1.925316 0.455224
C  2.793499 -3.786719 -1.494746
C  1.273996 -2.168705 -2.646401
C  2.520944 -0.037548 -0.631754
C  -0.011539 -1.474593 0.198905
C  1.480884 -2.768372 1.542624
C  2.436741 2.022557 0.50887
C  -1.077551 -1.849661 0.999883
C  0.426246 -3.157685 2.356582
C  1.25319 2.714022 -0.127886
C  -0.847618 -2.692736 2.075897
C  -0.035431 2.26508 0.128314
C  1.465013 3.822452 -0.936426
C  -1.106844 2.928796 -0.450234
C  2.542017 2.408003 1.918265
C  0.380817 4.490418 -1.48505
C  -0.910929 4.042263 -1.252594
C  -2.808153 1.311317 -0.677337
C  -3.909339 0.741368 -0.048222
C  -2.210497 0.679949 -1.761396
C  -4.412166 -0.464725 -0.510343
C  -2.7218 -0.532701 -2.206125
C  -3.819385 -1.11217 -1.587415
H  3.360689 -1.774118 0.114701
H  3.364436 -1.909502 -2.309551
H  3.697332 -3.921832 -0.89728
H  1.969563 -4.272671 -0.968251
H  2.939679 -4.322322 -2.434184
H  0.40391 -2.666696 -2.21513
H  1.460077 -2.634212 -3.615875
H  1.005807 -1.128641 -2.835851
H  -0.206538 -0.810679 -0.633345
H  2.477282 -3.12778 1.769732
H  3.362377 2.334327 0.013154
H  -2.07228 -1.482105 0.784305
H  0.603543 -3.81152 3.199955
H  -0.214386 1.412653 0.773475
H  2.47292 4.164898 -1.13466
H  0.542352 5.356836 -2.11238
H  -1.760884 4.551057 -1.689401
H  -4.366519 1.243113 0.795709
H  -1.357914 1.117114 -2.265723
H  -5.269024 -0.904675 -0.016311
H  -2.250085 -1.023509 -3.048073
H  -4.210333 -2.057461 -1.939746
elementType: Cl O N C H
totalener: -1706.65497785 hartree
nucrepener: 3063.89884397 hartree
electener: -4770.55382182 hartree
oneelecener: -8421.98130181 hartree
twoeener: 3651.42747999 hartree
cpcmener: -0.03316556 hartree
kineticenergy: 1700.53969492 hartree
xcener: -142.762150172017 hartree
chargesum: -0.0000000
charge: -0.094408 -0.276397 -0.415767 -0.328802 -0.085006 0.100177 0.090981 0.116210 -0.327597 -0.326741 0.343510 -0.345668 -0.205160 0.369017 -0.068251 -0.120933 0.029429 0.027706 -0.193297 -0.182289 0.197171 -0.225266 -0.126262 -0.182929 0.294977 -0.238115 -0.191949 -0.105536 -0.148359 -0.205525 0.101713 0.045949 0.098123 0.089677 0.102116 0.085319 0.107647 0.095169 0.168776 0.141352 0.145610 0.117045 0.141153 0.171937 0.145778 0.160217 0.149642 0.143224 0.148854 0.153125 0.158871 0.153784
qa: -0.0944 -0.2764 -0.4158 -0.3288 -0.0850 0.1002 0.0910 0.1162 -0.3276 -0.3267 0.3435 -0.3457 -0.2052 0.3690 -0.0683 -0.1209 0.0294 0.0277 -0.1933 -0.1823 0.1972 -0.2253 -0.1263 -0.1829 0.2950 -0.2381 -0.1919 -0.1055 -0.1484 -0.2055 0.1017 0.0459 0.0981 0.0897 0.1021 0.0853 0.1076 0.0952 0.1688 0.1414 0.1456 0.1170 0.1412 0.1719 0.1458 0.1602 0.1496 0.1432 0.1489 0.1531 0.1589 0.1538
va: 1.2158 2.1363 2.0881 2.0798 3.1118 3.7782 3.8327 3.4567 3.9451 3.9417 4.2422 3.9573 3.9739 3.7633 3.9063 3.9563 3.5781 3.9518 3.9753 3.9683 3.7915 4.0825 3.8878 3.9953 3.6786 3.9667 3.8163 3.8538 3.8437 3.8813 1.0237 1.0262 1.0022 0.9986 1.0046 0.9970 1.0071 1.0122 0.9648 1.0017 1.0146 1.0178 1.0052 0.9913 1.0014 0.9891 1.0016 1.0093 1.0060 0.9908 0.9906 0.9929
dispcorr: -0.033844945 hartree
energy: -1706.688822793854
dipole: 8.73163 -8.02843 0.70320 -9.84308 9.17913 -0.66395 -24.25635 22.26652 -1.98983
magnitude: 2.21241 au
magnitude: 5.62349 debye
