program: Orca
programVersion: 5.0.2
elementType: Cl O O O N C C C C C C C C C C C C C C C C C C C C C C C C C H H H H H H H H H H H H H H H H H H H H H H
charge: 0
multiplicity: 1
keywords: wb97x-d3
keywords: def2-TZVPP
keywords: def2/J RIJCOSX
keywords: DEFGRID2
keywords: scfconv7
keywords: smallprint printgap noloewdin
keywords: NOSOSCF
formula: C25H22ClNO3
InChI: InChI=1/C25H22ClNO3/c1-17(2)24(18-11-13-20(26)14-12-18)25(28)30-23(16-27)19-7-6-10-22(15-19)29-21-8-4-3-5-9-21/h3-15,17,23-24H,1-2H3
52 atoms
Cl -2.764942 -3.090807 -0.54714
O  2.743682 0.293432 -0.725168
O  2.987437 0.792451 1.432944
O  -2.153109 0.643977 -0.065846
N  4.483511 3.197952 -0.451093
C  2.909907 -1.533102 0.764004
C  4.066246 -2.221971 0.015903
C  1.513485 -2.012999 0.419266
C  5.399726 -1.579055 0.383698
C  4.088275 -3.709016 0.347785
C  2.902601 -0.034888 0.567386
C  1.153202 -2.416667 -0.862894
C  0.524894 -1.959284 1.397529
C  2.454087 1.650198 -1.019325
C  -0.15662 -2.758139 -1.163003
C  -0.790858 -2.292415 1.114201
C  1.136796 2.097193 -0.416916
C  -1.121943 -2.685746 -0.171277
C  0.055472 1.230794 -0.529807
C  0.978066 3.328751 0.201392
C  -1.172429 1.584893 0.00905
C  3.58641 2.512135 -0.660254
C  -0.263353 3.678635 0.714748
C  -1.342495 2.813737 0.637012
C  -3.47158 1.005835 -0.130294
C  -4.355684 0.347259 0.710876
C  -3.926419 1.944749 -1.047692
C  -5.712283 0.629372 0.628729
C  -5.283731 2.223962 -1.111932
C  -6.181075 1.570046 -0.277512
H  3.0702 -1.688627 1.834701
H  3.922444 -2.108456 -1.062234
H  5.467235 -0.534828 0.07109
H  5.573601 -1.616317 1.46153
H  6.222375 -2.106808 -0.100708
H  4.242583 -3.869435 1.417378
H  4.903472 -4.204993 -0.181131
H  3.163932 -4.214458 0.066231
H  1.889159 -2.467921 -1.654914
H  0.779225 -1.64368 2.402339
H  2.3815 1.680452 -2.109911
H  -0.417975 -3.068451 -2.165839
H  -1.542921 -2.239957 1.889936
H  0.150925 0.271621 -1.025124
H  1.80602 4.01914 0.297776
H  -0.387432 4.636115 1.203257
H  -2.293634 3.097154 1.068879
H  -3.986681 -0.383422 1.41945
H  -3.235101 2.448694 -1.711984
H  -6.402526 0.11267 1.283164
H  -5.640569 2.953722 -1.827209
H  -7.238844 1.790116 -0.336554
elementType: Cl O N C H
totalener: -1706.65482337 hartree
nucrepener: 3032.71669111 hartree
electener: -4739.37151448 hartree
oneelecener: -8360.54756373 hartree
twoeener: 3621.17604926 hartree
cpcmener: -0.03475920 hartree
kineticenergy: 1700.53667074 hartree
xcener: -142.762710671952 hartree
chargesum: -0.0000000
charge: -0.099882 -0.270536 -0.399869 -0.308756 -0.079614 0.185075 0.040577 0.035455 -0.297297 -0.293832 0.288848 -0.268003 -0.202481 0.457551 -0.120286 -0.173409 0.001650 0.110338 -0.334529 -0.202232 0.297773 -0.247160 -0.110869 -0.212553 0.286098 -0.257965 -0.201980 -0.117293 -0.136878 -0.179945 0.098325 0.054384 0.092932 0.095922 0.093463 0.091320 0.095852 0.099553 0.141902 0.138019 0.143294 0.141618 0.144515 0.157124 0.132610 0.160367 0.156587 0.142687 0.158117 0.157735 0.158045 0.157634
qa: -0.0999 -0.2705 -0.3999 -0.3088 -0.0796 0.1851 0.0406 0.0355 -0.2973 -0.2938 0.2888 -0.2680 -0.2025 0.4576 -0.1203 -0.1734 0.0017 0.1103 -0.3345 -0.2022 0.2978 -0.2472 -0.1109 -0.2126 0.2861 -0.2580 -0.2020 -0.1173 -0.1369 -0.1799 0.0983 0.0544 0.0929 0.0959 0.0935 0.0913 0.0959 0.0996 0.1419 0.1380 0.1433 0.1416 0.1445 0.1571 0.1326 0.1604 0.1566 0.1427 0.1581 0.1577 0.1580 0.1576
va: 1.2027 2.1211 2.1051 2.0669 3.1011 3.6259 3.8293 3.4927 3.9477 3.9328 4.2117 3.9907 4.0031 3.8428 3.9907 3.9453 3.7506 3.7868 4.0566 3.9425 3.7658 4.0926 3.9214 3.9537 3.6657 3.9921 3.9500 3.8810 3.8923 3.9061 1.0278 1.0232 1.0085 1.0037 1.0035 1.0021 1.0051 1.0023 1.0076 1.0086 0.9907 1.0062 1.0027 1.0038 1.0173 0.9906 0.9972 1.0109 0.9965 0.9902 0.9902 0.9903
dispcorr: -0.032508184 hartree
energy: -1706.687331553914
dipole: 15.52110 -16.69459 -1.17348 -4.13636 3.20104 -0.93532 3.16251 -4.01513 -0.85262
magnitude: 1.72593 au
magnitude: 4.38698 debye
