program: Orca
programVersion: 5.0.2
elementType: Cl O O O N C C C C C C C C C C C C C C C C C C C C C C C C C H H H H H H H H H H H H H H H H H H H H H H
charge: 0
multiplicity: 1
keywords: wb97x-d3
keywords: def2-TZVPP
keywords: def2/J RIJCOSX
keywords: DEFGRID2
keywords: scfconv7
keywords: smallprint printgap noloewdin
keywords: NOSOSCF
formula: C25H22ClNO3
InChI: InChI=1/C25H22ClNO3/c1-17(2)24(18-11-13-20(26)14-12-18)25(28)30-23(16-27)19-7-6-10-22(15-19)29-21-8-4-3-5-9-21/h3-15,17,23-24H,1-2H3
52 atoms
Cl -2.514859 -3.332056 0.510654
O  2.847015 0.814073 0.735496
O  3.6305 0.354688 -1.304507
O  -2.096859 0.917006 0.277103
N  2.591451 3.582689 2.529287
C  3.209671 -1.451722 0.268799
C  4.113186 -2.420505 -0.526853
C  1.758038 -1.878488 0.332898
C  4.333405 -3.695113 0.281222
C  3.614854 -2.776909 -1.922379
C  3.277445 -0.0254 -0.222135
C  1.285233 -2.570648 1.443283
C  0.872825 -1.62296 -0.713073
C  2.561712 2.152017 0.343934
C  -0.0255 -3.019842 1.508374
C  -0.442819 -2.056062 -0.66158
C  1.212732 2.221834 -0.330336
C  -0.878761 -2.760015 0.449042
C  0.124221 1.621806 0.289706
C  1.073094 2.827514 -1.569709
C  -1.10433 1.605463 -0.350302
C  2.577485 2.934945 1.580748
C  -0.168312 2.818057 -2.19149
C  -1.258214 2.200652 -1.598519
C  -3.409199 1.284497 0.156201
C  -4.336013 0.258973 0.037533
C  -3.820747 2.609699 0.222699
C  -5.688553 0.562468 -0.009262
C  -5.176836 2.898665 0.162027
C  -6.115304 1.881802 0.047423
H  3.588659 -1.43412 1.295953
H  5.083341 -1.923236 -0.628089
H  5.046464 -4.347886 -0.224785
H  4.731379 -3.484088 1.275613
H  3.407696 -4.261236 0.404659
H  4.361899 -3.391197 -2.428499
H  3.437943 -1.904881 -2.55008
H  2.692753 -3.3596 -1.88676
H  1.948292 -2.768551 2.276447
H  1.197554 -1.0820 -1.593355
H  3.340964 2.557067 -0.309337
H  -0.370236 -3.563145 2.37798
H  -1.113838 -1.847791 -1.484038
H  0.221378 1.148954 1.260126
H  1.923816 3.291977 -2.051644
H  -0.285681 3.279015 -3.163395
H  -2.209791 2.178091 -2.114058
H  -3.997803 -0.768616 -0.006402
H  -3.100809 3.411609 0.329628
H  -6.409297 -0.240525 -0.094954
H  -5.499479 3.930481 0.214739
H  -7.170824 2.116056 0.007077
elementType: Cl O N C H
totalener: -1706.65450315 hartree
nucrepener: 3009.58507755 hartree
electener: -4716.23958070 hartree
oneelecener: -8313.96302845 hartree
twoeener: 3597.72344775 hartree
cpcmener: -0.03115735 hartree
kineticenergy: 1700.53410486 hartree
xcener: -142.758913021662 hartree
chargesum: 0.0000000
charge: -0.101545 -0.275244 -0.410261 -0.318724 -0.085820 0.134700 0.080787 0.040532 -0.326089 -0.315223 0.329185 -0.232511 -0.238468 0.407452 -0.127875 -0.176392 0.070831 0.108746 -0.280976 -0.197695 0.266173 -0.235238 -0.114060 -0.201178 0.291061 -0.234423 -0.194998 -0.141082 -0.149445 -0.174280 0.097927 0.051299 0.101617 0.097429 0.088386 0.104626 0.098424 0.085096 0.145656 0.148977 0.140239 0.144068 0.143961 0.132164 0.145256 0.160625 0.158288 0.129141 0.156253 0.156344 0.158686 0.157599
qa: -0.1015 -0.2752 -0.4103 -0.3187 -0.0858 0.1347 0.0808 0.0405 -0.3261 -0.3152 0.3292 -0.2325 -0.2385 0.4075 -0.1279 -0.1764 0.0708 0.1087 -0.2810 -0.1977 0.2662 -0.2352 -0.1141 -0.2012 0.2911 -0.2344 -0.1950 -0.1411 -0.1494 -0.1743 0.0979 0.0513 0.1016 0.0974 0.0884 0.1046 0.0984 0.0851 0.1457 0.1490 0.1402 0.1441 0.1440 0.1322 0.1453 0.1606 0.1583 0.1291 0.1563 0.1563 0.1587 0.1576
va: 1.2043 2.1347 2.0841 2.0553 3.1131 3.7181 3.8278 3.4466 3.9418 3.9340 4.2643 4.0008 3.9127 3.7396 3.9931 3.9546 3.5386 3.8341 4.0402 3.9727 3.7017 4.0943 3.9026 3.9538 3.6795 3.9712 3.9215 3.9240 3.8978 3.8978 1.0364 1.0196 1.0049 1.0021 1.0000 1.0052 1.0170 0.9972 0.9995 1.0030 1.0167 1.0043 1.0047 1.0298 1.0038 0.9898 0.9962 1.0303 0.9981 0.9905 0.9903 0.9904
dispcorr: -0.031996848 hartree
energy: -1706.686499994869
dipole: 13.64741 -13.63823 0.00918 -6.99080 6.39863 -0.59216 -9.39119 8.16082 -1.23038
magnitude: 1.36549 au
magnitude: 3.47081 debye
