program: Orca
programVersion: 5.0.2
elementType: Cl O O O N C C C C C C C C C C C C C C C C C C C C C C C C C H H H H H H H H H H H H H H H H H H H H H H
charge: 0
multiplicity: 1
keywords: wb97x-d3
keywords: def2-TZVPP
keywords: def2/J RIJCOSX
keywords: DEFGRID2
keywords: scfconv7
keywords: smallprint printgap noloewdin
keywords: NOSOSCF
formula: C25H22ClNO3
InChI: InChI=1/C25H22ClNO3/c1-17(2)24(18-11-13-20(26)14-12-18)25(28)30-23(16-27)19-7-6-10-22(15-19)29-21-8-4-3-5-9-21/h3-15,17,23-24H,1-2H3
52 atoms
Cl -2.895759 -3.41801 1.55879
O  2.146318 0.462391 -0.06249
O  3.724119 -0.102319 1.405525
O  -2.227293 2.531378 -1.675431
N  1.418267 2.046841 2.856319
C  2.717431 -1.822149 0.029783
C  3.085431 -1.951828 -1.462744
C  1.299146 -2.231522 0.37405
C  4.492199 -1.421927 -1.72332
C  2.977807 -3.408214 -1.896127
C  2.947532 -0.421036 0.546121
C  0.204816 -1.85469 -0.401991
C  1.065781 -2.978586 1.523861
C  2.190646 1.812967 0.365367
C  -1.0841 -2.214906 -0.043097
C  -0.218049 -3.347431 1.899137
C  1.246112 2.603477 -0.504787
C  -1.286426 -2.959449 1.108631
C  -0.061517 2.156083 -0.667104
C  1.681404 3.769502 -1.112461
C  -0.940041 2.902159 -1.437923
C  1.767448 1.914955 1.769811
C  0.792257 4.499736 -1.891375
C  -0.514507 4.076906 -2.052504
C  -2.881076 1.674044 -0.827709
C  -2.914798 1.887094 0.544836
C  -3.567235 0.613551 -1.399877
C  -3.632175 1.012228 1.346741
C  -4.295575 -0.24401 -0.586435
C  -4.323522 -0.054839 0.787826
H  3.402566 -2.460175 0.594883
H  2.384267 -1.360944 -2.05857
H  4.584451 -0.351461 -1.52836
H  5.23178 -1.938586 -1.107344
H  4.768504 -1.575558 -2.767372
H  3.680848 -4.034928 -1.342439
H  3.21076 -3.509169 -2.957053
H  1.977248 -3.813779 -1.742432
H  0.338858 -1.276293 -1.30659
H  1.899552 -3.283964 2.144572
H  3.204618 2.21778 0.29157
H  -1.920752 -1.913717 -0.659138
H  -0.37408 -3.929874 2.79721
H  -0.384397 1.238745 -0.189502
H  2.701593 4.106785 -0.982156
H  1.120648 5.411159 -2.37298
H  -1.208913 4.648934 -2.655073
H  -2.389186 2.723703 0.988564
H  -3.536533 0.465519 -2.472257
H  -3.652663 1.172557 2.416973
H  -4.833742 -1.070347 -1.032859
H  -4.881589 -0.732077 1.419896
elementType: Cl O N C H
totalener: -1706.65667882 hartree
nucrepener: 3033.44506820 hartree
electener: -4740.10174702 hartree
oneelecener: -8361.45118848 hartree
twoeener: 3621.34944147 hartree
cpcmener: -0.03382007 hartree
kineticenergy: 1700.53982991 hartree
xcener: -142.759871383473 hartree
chargesum: -0.0000000
charge: -0.096074 -0.267614 -0.410695 -0.323827 -0.085594 0.174297 0.029873 0.005271 -0.297770 -0.296203 0.319644 -0.245694 -0.184014 0.400128 -0.165284 -0.144280 0.008336 0.092612 -0.239104 -0.207946 0.299382 -0.230085 -0.102986 -0.245935 0.305172 -0.203678 -0.250840 -0.119411 -0.128470 -0.190213 0.092737 0.057994 0.091328 0.096862 0.094208 0.090436 0.096873 0.099624 0.143884 0.139797 0.132649 0.164870 0.141872 0.139108 0.145396 0.158763 0.146523 0.155186 0.144989 0.159877 0.156039 0.151990
qa: -0.0961 -0.2676 -0.4107 -0.3238 -0.0856 0.1743 0.0299 0.0053 -0.2978 -0.2962 0.3196 -0.2457 -0.1840 0.4001 -0.1653 -0.1443 0.0083 0.0926 -0.2391 -0.2079 0.2994 -0.2301 -0.1030 -0.2459 0.3052 -0.2037 -0.2508 -0.1194 -0.1285 -0.1902 0.0927 0.0580 0.0913 0.0969 0.0942 0.0904 0.0969 0.0996 0.1439 0.1398 0.1326 0.1649 0.1419 0.1391 0.1454 0.1588 0.1465 0.1552 0.1450 0.1599 0.1560 0.1520
va: 1.2118 2.1526 2.0923 2.0963 3.1104 3.6251 3.8388 3.5363 3.9443 3.9283 4.2288 3.9762 4.0232 3.7583 3.9475 3.9847 3.7377 3.8589 3.9550 3.9578 3.7436 4.0202 3.8992 4.0032 3.6336 3.9263 3.9835 3.8648 3.8239 3.8626 1.0319 1.0218 1.0086 1.0036 1.0036 1.0020 1.0052 1.0018 1.0113 1.0044 1.0184 0.9958 1.0062 1.0147 1.0030 0.9894 1.0072 0.9973 1.0077 0.9892 0.9918 0.9988
dispcorr: -0.031883977 hartree
energy: -1706.688562797646
dipole: 18.32802 -17.71018 0.61784 -3.71024 3.52156 -0.18868 -16.01375 13.57692 -2.43683
magnitude: 2.52101 au
magnitude: 6.40789 debye
