program: Orca
programVersion: 5.0.2
elementType: Cl O O O N C C C C C C C C C C C C C C C C C C C C C C C C C H H H H H H H H H H H H H H H H H H H H H H
charge: 0
multiplicity: 1
keywords: wb97x-d3
keywords: def2-TZVPP
keywords: def2/J RIJCOSX
keywords: DEFGRID2
keywords: scfconv7
keywords: smallprint printgap noloewdin
keywords: NOSOSCF
formula: C25H22ClNO3
InChI: InChI=1/C25H22ClNO3/c1-17(2)24(18-11-13-20(26)14-12-18)25(28)30-23(16-27)19-7-6-10-22(15-19)29-21-8-4-3-5-9-21/h3-15,17,23-24H,1-2H3
52 atoms
Cl -0.273142 -3.537771 3.946952
O  2.38277 0.781188 -0.368397
O  1.34922 -0.284549 -2.035748
O  -3.455442 1.087097 -0.473843
N  2.471155 3.853989 0.815964
C  2.97665 -1.4710 -0.691742
C  3.26189 -2.474106 -1.818507
C  2.179375 -2.037559 0.468735
C  4.133597 -1.835835 -2.895441
C  3.944505 -3.71708 -1.260513
C  2.162577 -0.284535 -1.152092
C  0.91121 -2.57649 0.265404
C  2.676075 -1.976763 1.765027
C  1.409477 1.820304 -0.431664
C  0.155137 -3.044257 1.327558
C  1.932748 -2.44141 2.840822
C  0.123592 1.393688 0.238156
C  0.673172 -2.968945 2.611073
C  -1.072015 1.481343 -0.458704
C  0.160269 0.878775 1.529802
C  -2.248451 1.070262 0.158783
C  2.014663 2.951746 0.272244
C  -1.01647 0.448153 2.119784
C  -2.223362 0.548189 1.443935
C  -3.784535 2.091735 -1.342911
C  -4.519903 1.73316 -2.464215
C  -3.466988 3.422541 -1.098659
C  -4.941485 2.716012 -3.347943
C  -3.883242 4.392461 -1.999463
C  -4.62029 4.047828 -3.124673
H  3.931872 -1.10654 -0.3009
H  2.312276 -2.776448 -2.270097
H  3.670277 -0.959942 -3.351378
H  5.097492 -1.525414 -2.484915
H  4.333311 -2.546458 -3.698747
H  4.8767 -3.463394 -0.749822
H  4.19062 -4.409962 -2.066306
H  3.314022 -4.254917 -0.552113
H  0.491955 -2.631781 -0.731555
H  3.658527 -1.558796 1.947647
H  1.224047 2.134533 -1.463354
H  -0.829962 -3.455025 1.152174
H  2.334543 -2.385837 3.843671
H  -1.079174 1.861166 -1.473156
H  1.093931 0.81084 2.074039
H  -0.999414 0.041397 3.122124
H  -3.144313 0.220026 1.909252
H  -4.765035 0.692449 -2.63764
H  -2.907162 3.70916 -0.217105
H  -5.519453 2.4342 -4.218853
H  -3.633108 5.428684 -1.81157
H  -4.944693 4.811625 -3.819047
elementType: Cl O N C H
totalener: -1706.65732499 hartree
nucrepener: 2956.68548506 hartree
electener: -4663.34281005 hartree
oneelecener: -8207.89479532 hartree
twoeener: 3544.55198527 hartree
cpcmener: -0.03144512 hartree
kineticenergy: 1700.53834354 hartree
xcener: -142.758643755890 hartree
chargesum: -0.0000000
charge: -0.098748 -0.273485 -0.415205 -0.324952 -0.084554 0.148268 0.059823 -0.014793 -0.292559 -0.309418 0.310208 -0.173893 -0.197736 0.394766 -0.184138 -0.144227 0.072514 0.116089 -0.193386 -0.279139 0.281819 -0.230449 -0.132734 -0.214070 0.293125 -0.254984 -0.199062 -0.116904 -0.140105 -0.189138 0.096318 0.046174 0.094405 0.088495 0.093707 0.090078 0.097616 0.098124 0.141939 0.138626 0.139448 0.141842 0.141813 0.145266 0.153252 0.154618 0.147447 0.145572 0.157261 0.158219 0.158944 0.157903
qa: -0.0987 -0.2735 -0.4152 -0.3250 -0.0846 0.1483 0.0598 -0.0148 -0.2926 -0.3094 0.3102 -0.1739 -0.1977 0.3948 -0.1841 -0.1442 0.0725 0.1161 -0.1934 -0.2791 0.2818 -0.2304 -0.1327 -0.2141 0.2931 -0.2550 -0.1991 -0.1169 -0.1401 -0.1891 0.0963 0.0462 0.0944 0.0885 0.0937 0.0901 0.0976 0.0981 0.1419 0.1386 0.1394 0.1418 0.1418 0.1453 0.1533 0.1546 0.1474 0.1456 0.1573 0.1582 0.1589 0.1579
va: 1.2026 2.1511 2.0839 2.0857 3.1122 3.6629 3.8125 3.4707 3.9290 3.9484 4.2873 3.9277 3.9809 3.7532 4.0082 3.9871 3.5348 3.7767 3.9597 3.9633 3.7455 4.0821 3.8822 4.0110 3.6881 4.0125 3.9144 3.8818 3.8885 3.9101 1.0376 1.0276 1.0129 1.0021 1.0046 1.0021 1.0046 1.0007 1.0161 1.0047 1.0171 1.0082 1.0061 1.0091 1.0044 0.9928 1.0049 1.0086 0.9969 0.9890 0.9904 0.9907
dispcorr: -0.030860798 hartree
energy: -1706.688185787597
dipole: 12.05771 -11.85664 0.20107 -3.35299 2.49897 -0.85402 -22.16000 21.33948 -0.82051
magnitude: 1.20126 au
magnitude: 3.05336 debye
