program: Orca
programVersion: 5.0.2
elementType: Cl O O O N C C C C C C C C C C C C C C C C C C C C C C C C C H H H H H H H H H H H H H H H H H H H H H H
charge: 0
multiplicity: 1
keywords: wb97x-d3
keywords: def2-TZVPP
keywords: def2/J RIJCOSX
keywords: DEFGRID2
keywords: scfconv7
keywords: smallprint printgap noloewdin
keywords: NOSOSCF
formula: C25H22ClNO3
InChI: InChI=1/C25H22ClNO3/c1-17(2)24(18-11-13-20(26)14-12-18)25(28)30-23(16-27)19-7-6-10-22(15-19)29-21-8-4-3-5-9-21/h3-15,17,23-24H,1-2H3
52 atoms
Cl -3.209953 -3.630536 0.318585
O  2.215837 0.450495 -0.824737
O  2.896791 0.811944 1.263399
O  -2.215517 2.214787 0.908178
N  4.679299 2.785077 -0.841675
C  2.399203 -1.449857 0.577502
C  3.31999 -2.2200 -0.397109
C  0.95162 -1.887937 0.496277
C  4.763846 -1.746955 -0.267003
C  3.224474 -3.716444 -0.126218
C  2.53491 0.044247 0.414727
C  0.24056 -1.911695 -0.702588
C  0.3216 -2.355261 1.644895
C  2.253011 1.840324 -1.091362
C  -1.049514 -2.416541 -0.759093
C  -0.966351 -2.868569 1.605858
C  1.20692 2.631913 -0.331162
C  -1.636969 -2.910461 0.395621
C  -0.016771 2.027622 -0.068155
C  1.428007 3.953804 0.030621
C  -1.016852 2.759017 0.557748
C  3.613002 2.364039 -0.910664
C  0.418493 4.66885 0.65874
C  -0.80727 4.082607 0.920406
C  -2.880885 1.328889 0.108556
C  -3.727183 0.440753 0.761381
C  -2.79901 1.336381 -1.278193
C  -4.503399 -0.435478 0.020543
C  -3.569599 0.438094 -2.005177
C  -4.423368 -0.448632 -1.365725
H  2.752255 -1.657226 1.591223
H  2.98447 -2.034521 -1.421828
H  4.894972 -0.697334 -0.538486
H  5.130926 -1.874777 0.753801
H  5.413353 -2.32536 -0.925424
H  3.898041 -4.265176 -0.786093
H  2.219503 -4.105342 -0.292627
H  3.506843 -3.950501 0.903019
H  0.691412 -1.559658 -1.62116
H  0.850553 -2.342833 2.590001
H  2.040158 1.913431 -2.1618
H  -1.579302 -2.44326 -1.701765
H  -1.427069 -3.248142 2.507961
H  -0.194308 0.99454 -0.340736
H  2.376527 4.437064 -0.165253
H  0.590679 5.697698 0.945854
H  -1.595246 4.639915 1.410621
H  -3.784033 0.450056 1.842848
H  -2.155346 2.033205 -1.799404
H  -5.168224 -1.117181 0.533578
H  -3.502559 0.443335 -3.085588
H  -5.024673 -1.139881 -1.941199
elementType: Cl O N C H
totalener: -1706.65394690 hartree
nucrepener: 3059.86282870 hartree
electener: -4766.51677560 hartree
oneelecener: -8414.31095416 hartree
twoeener: 3647.79417856 hartree
cpcmener: -0.03462224 hartree
kineticenergy: 1700.53543994 hartree
xcener: -142.763834967384 hartree
chargesum: -0.0000000
charge: -0.099235 -0.281874 -0.400682 -0.320939 -0.080976 0.178779 0.040681 -0.055220 -0.286069 -0.304343 0.310499 -0.165671 -0.164301 0.464934 -0.205586 -0.150180 -0.022351 0.128280 -0.250200 -0.219754 0.318034 -0.242755 -0.092454 -0.256663 0.343165 -0.276962 -0.218470 -0.114108 -0.140085 -0.192258 0.090749 0.059074 0.089269 0.094233 0.093439 0.098311 0.098891 0.091084 0.138538 0.139842 0.143310 0.141699 0.140693 0.138354 0.133608 0.159454 0.145556 0.142377 0.155706 0.153151 0.157164 0.152259
qa: -0.0992 -0.2819 -0.4007 -0.3209 -0.0810 0.1788 0.0407 -0.0552 -0.2861 -0.3043 0.3105 -0.1657 -0.1643 0.4649 -0.2056 -0.1502 -0.0224 0.1283 -0.2502 -0.2198 0.3180 -0.2428 -0.0925 -0.2567 0.3432 -0.2770 -0.2185 -0.1141 -0.1401 -0.1923 0.0907 0.0591 0.0893 0.0942 0.0934 0.0983 0.0989 0.0911 0.1385 0.1398 0.1433 0.1417 0.1407 0.1384 0.1336 0.1595 0.1456 0.1424 0.1557 0.1532 0.1572 0.1523
va: 1.2030 2.1114 2.1009 2.0998 3.0966 3.6375 3.8199 3.5715 3.9503 3.9345 4.2236 3.8998 4.0052 3.8088 3.9786 4.0051 3.7878 3.7790 3.9910 3.9676 3.7007 4.1038 3.8984 4.0241 3.6363 3.9673 3.8905 3.8158 3.8598 3.8710 1.0350 1.0209 1.0086 1.0039 1.0043 1.0052 1.0008 1.0023 1.0206 1.0024 0.9894 1.0078 1.0074 1.0160 1.0169 0.9893 1.0075 1.0117 0.9965 0.9975 0.9905 0.9946
dispcorr: -0.033331925 hartree
energy: -1706.687278821869
dipole: 16.38451 -17.42664 -1.04213 -6.29067 5.27664 -1.01403 -4.06993 2.81049 -1.25943
magnitude: 1.92366 au
magnitude: 4.88955 debye
