program: Orca
programVersion: 5.0.2
elementType: Cl O O O N C C C C C C C C C C C C C C C C C C C C C C C C C H H H H H H H H H H H H H H H H H H H H H H
charge: 0
multiplicity: 1
keywords: wb97x-d3
keywords: def2-TZVPP
keywords: def2/J RIJCOSX
keywords: DEFGRID2
keywords: scfconv7
keywords: smallprint printgap noloewdin
keywords: NOSOSCF
formula: C25H22ClNO3
InChI: InChI=1/C25H22ClNO3/c1-17(2)24(18-11-13-20(26)14-12-18)25(28)30-23(16-27)19-7-6-10-22(15-19)29-21-8-4-3-5-9-21/h3-15,17,23-24H,1-2H3
52 atoms
Cl -2.672352 -2.46585 -2.133301
O  2.223656 0.662477 1.24499
O  3.771631 0.262795 -0.317205
O  -2.427765 1.270215 -0.822594
N  1.474986 3.372272 2.992504
C  2.576111 -1.585529 0.713402
C  3.694227 -2.601888 0.396463
C  1.265604 -1.811882 -0.016783
C  3.377652 -3.927459 1.080551
C  3.973695 -2.837597 -1.08259
C  2.964633 -0.14888 0.470066
C  1.094875 -1.43125 -1.347197
C  0.186075 -2.385524 0.647464
C  2.126969 2.026327 0.850828
C  -0.112199 -1.623175 -2.000172
C  -1.027935 -2.591748 0.007697
C  1.074368 2.170863 -0.221741
C  -1.164865 -2.208561 -1.316126
C  -0.197598 1.660115 0.018276
C  1.389434 2.751905 -1.439343
C  -1.167435 1.763566 -0.966392
C  1.759817 2.763846 2.060801
C  0.411018 2.834089 -2.422532
C  -0.864578 2.350072 -2.191842
C  -2.996715 1.146597 0.418388
C  -2.954004 2.172578 1.355078
C  -3.681699 -0.028916 0.687058
C  -3.585249 1.998671 2.577874
C  -4.320803 -0.183331 1.90914
C  -4.26736 0.822937 2.862855
H  2.364492 -1.671017 1.783691
H  4.60583 -2.203805 0.854608
H  2.472543 -4.384573 0.674195
H  4.193311 -4.637769 0.935018
H  3.235633 -3.805882 2.156243
H  3.131681 -3.319759 -1.582414
H  4.831903 -3.504161 -1.186993
H  4.210112 -1.922876 -1.623897
H  1.902062 -0.967263 -1.899065
H  0.286549 -2.677113 1.685827
H  3.08808 2.419609 0.505709
H  -0.224419 -1.31525 -3.031062
H  -1.852842 -3.043216 0.542329
H  -0.423036 1.185071 0.965711
H  2.384957 3.135498 -1.621762
H  0.643774 3.284343 -3.378459
H  -1.62748 2.420958 -2.957118
H  -2.436317 3.099474 1.141389
H  -3.725704 -0.81139 -0.059444
H  -3.546407 2.795031 3.309993
H  -4.855698 -1.10151 2.115012
H  -4.757616 0.695478 3.818994
elementType: Cl O N C H
totalener: -1706.65363441 hartree
nucrepener: 3095.93129818 hartree
electener: -4802.58493259 hartree
oneelecener: -8486.69219541 hartree
twoeener: 3684.10726281 hartree
cpcmener: -0.03037394 hartree
kineticenergy: 1700.53565468 hartree
xcener: -142.760319316811 hartree
chargesum: -0.0000000
charge: -0.098262 -0.281034 -0.409973 -0.322293 -0.086204 0.142177 0.075847 0.045342 -0.319276 -0.312132 0.330096 -0.265946 -0.214972 0.418912 -0.139564 -0.135357 0.040800 0.080655 -0.218472 -0.201446 0.263859 -0.233926 -0.098169 -0.256842 0.314894 -0.199817 -0.277568 -0.140059 -0.127575 -0.179055 0.094393 0.051732 0.088688 0.100003 0.095736 0.083919 0.103897 0.098521 0.150371 0.143272 0.137903 0.143722 0.143160 0.139953 0.146091 0.159218 0.145586 0.154219 0.150820 0.159432 0.157273 0.157451
qa: -0.0983 -0.2810 -0.4100 -0.3223 -0.0862 0.1422 0.0758 0.0453 -0.3193 -0.3121 0.3301 -0.2659 -0.2150 0.4189 -0.1396 -0.1354 0.0408 0.0807 -0.2185 -0.2014 0.2639 -0.2339 -0.0982 -0.2568 0.3149 -0.1998 -0.2776 -0.1401 -0.1276 -0.1791 0.0944 0.0517 0.0887 0.1000 0.0957 0.0839 0.1039 0.0985 0.1504 0.1433 0.1379 0.1437 0.1432 0.1400 0.1461 0.1592 0.1456 0.1542 0.1508 0.1594 0.1573 0.1575
va: 1.2063 2.1301 2.0830 2.0668 3.1112 3.6941 3.8290 3.4472 3.9394 3.9341 4.2825 3.9277 3.9712 3.7404 3.9739 3.9164 3.5972 3.7854 3.9061 3.9521 3.6795 4.0889 3.8896 4.0201 3.6578 3.9232 3.9558 3.8837 3.9141 3.9149 1.0409 1.0182 1.0002 1.0046 1.0029 0.9974 1.0056 1.0180 1.0041 1.0007 1.0206 1.0071 1.0046 1.0192 1.0036 0.9883 1.0076 0.9984 1.0234 0.9897 0.9907 0.9904
dispcorr: -0.034355060 hartree
energy: -1706.687989473665
dipole: 17.07443 -16.61259 0.46184 -11.57464 10.61998 -0.95466 5.47634 -5.79883 -0.32249
magnitude: 1.10846 au
magnitude: 2.81747 debye
