program: Orca
programVersion: 5.0.2
elementType: Cl O O O N C C C C C C C C C C C C C C C C C C C C C C C C C H H H H H H H H H H H H H H H H H H H H H H
charge: 0
multiplicity: 1
keywords: wb97x-d3
keywords: def2-TZVPP
keywords: def2/J RIJCOSX
keywords: DEFGRID2
keywords: scfconv7
keywords: smallprint printgap noloewdin
keywords: NOSOSCF
formula: C25H22ClNO3
InChI: InChI=1/C25H22ClNO3/c1-17(2)24(18-11-13-20(26)14-12-18)25(28)30-23(16-27)19-7-6-10-22(15-19)29-21-8-4-3-5-9-21/h3-15,17,23-24H,1-2H3
52 atoms
Cl -2.660559 -3.159173 0.19867
O  2.86388 0.732461 0.749424
O  3.391671 0.234176 -1.362532
O  -2.155108 0.759477 0.255782
N  2.461566 3.474352 2.5433
C  3.149661 -1.546936 0.26237
C  4.056104 -2.48669 -0.546964
C  1.684294 -1.939835 0.242719
C  5.519092 -2.079098 -0.402568
C  3.86809 -3.928589 -0.088777
C  3.186629 -0.121346 -0.233694
C  1.02967 -2.279353 1.420989
C  0.963238 -1.95678 -0.94906
C  2.514599 2.053684 0.351719
C  -0.308226 -2.646378 1.418699
C  -0.374459 -2.318351 -0.969347
C  1.16667 2.076265 -0.329258
C  -0.998287 -2.666149 0.218506
C  0.085161 1.452408 0.283025
C  1.020608 2.690476 -1.563124
C  -1.142185 1.435003 -0.358869
C  2.493045 2.834067 1.590285
C  -0.217614 2.670846 -2.190593
C  -1.300271 2.038942 -1.602355
C  -3.427439 1.26572 0.228164
C  -4.466721 0.361239 0.066437
C  -3.686345 2.618725 0.412013
C  -5.777013 0.816663 0.088515
C  -5.001158 3.060883 0.419885
C  -6.051006 2.166613 0.258143
H  3.486032 -1.556014 1.303931
H  3.77526 -2.421917 -1.602766
H  5.714282 -1.066303 -0.757055
H  5.838176 -2.133419 0.641011
H  6.161511 -2.748545 -0.976654
H  4.083508 -4.037968 0.977011
H  4.546818 -4.589986 -0.62944
H  2.855029 -4.292431 -0.262862
H  1.56904 -2.266891 2.36009
H  1.439829 -1.689844 -1.88437
H  3.279378 2.492264 -0.297257
H  -0.79922 -2.915689 2.344199
H  -0.919031 -2.329544 -1.903842
H  0.18603 0.975325 1.251306
H  1.866241 3.172252 -2.036854
H  -0.337619 3.138402 -3.158893
H  -2.254572 2.014053 -2.113206
H  -4.249288 -0.690291 -0.070858
H  -2.877903 3.325359 0.552889
H  -6.586122 0.108617 -0.036719
H  -5.202901 4.11482 0.561684
H  -7.073922 2.519043 0.26749
elementType: Cl O N C H
totalener: -1706.65768687 hartree
nucrepener: 3018.10883572 hartree
electener: -4724.76652259 hartree
oneelecener: -8331.30390794 hartree
twoeener: 3606.53738535 hartree
cpcmener: -0.03182012 hartree
kineticenergy: 1700.53823887 hartree
xcener: -142.758178925968 hartree
chargesum: -0.0000000
charge: -0.104175 -0.276792 -0.414749 -0.323844 -0.085696 0.142201 0.061451 -0.033736 -0.291013 -0.312080 0.314290 -0.186130 -0.160852 0.409112 -0.144626 -0.193631 0.071476 0.130212 -0.284930 -0.188471 0.236811 -0.234103 -0.117276 -0.184446 0.270336 -0.238689 -0.171126 -0.145902 -0.156436 -0.172078 0.095964 0.045996 0.095151 0.088779 0.092928 0.089923 0.098674 0.097968 0.138313 0.142447 0.142243 0.142972 0.141616 0.137521 0.144912 0.160339 0.159806 0.141633 0.155279 0.156999 0.158219 0.157210
qa: -0.1042 -0.2768 -0.4147 -0.3238 -0.0857 0.1422 0.0615 -0.0337 -0.2910 -0.3121 0.3143 -0.1861 -0.1609 0.4091 -0.1446 -0.1936 0.0715 0.1302 -0.2849 -0.1885 0.2368 -0.2341 -0.1173 -0.1844 0.2703 -0.2387 -0.1711 -0.1459 -0.1564 -0.1721 0.0960 0.0460 0.0952 0.0888 0.0929 0.0899 0.0987 0.0980 0.1383 0.1424 0.1422 0.1430 0.1416 0.1375 0.1449 0.1603 0.1598 0.1416 0.1553 0.1570 0.1582 0.1572
va: 1.1980 2.1489 2.0839 2.0378 3.1121 3.6779 3.8100 3.4687 3.9274 3.9520 4.2693 3.9823 3.9114 3.7334 4.0144 4.0151 3.5404 3.7514 4.0463 3.9715 3.7144 4.0901 3.9022 3.9547 3.7035 3.9715 3.9044 3.9370 3.9028 3.8950 1.0385 1.0270 1.0132 1.0019 1.0048 1.0020 1.0047 1.0003 1.0044 1.0162 1.0137 1.0060 1.0075 1.0232 1.0036 0.9899 0.9946 1.0281 0.9973 0.9907 0.9906 0.9902
dispcorr: -0.031888570 hartree
energy: -1706.689575438103
dipole: 17.42506 -17.26071 0.16435 -5.74692 5.18500 -0.56192 -5.74731 4.58797 -1.15933
magnitude: 1.29878 au
magnitude: 3.30123 debye
