program: Orca
programVersion: 5.0.2
elementType: Cl O O O N C C C C C C C C C C C C C C C C C C C C C C C C C H H H H H H H H H H H H H H H H H H H H H H
charge: 0
multiplicity: 1
keywords: wb97x-d3
keywords: def2-TZVPP
keywords: def2/J RIJCOSX
keywords: DEFGRID2
keywords: scfconv7
keywords: smallprint printgap noloewdin
keywords: NOSOSCF
formula: C25H22ClNO3
InChI: InChI=1/C25H22ClNO3/c1-17(2)24(18-11-13-20(26)14-12-18)25(28)30-23(16-27)19-7-6-10-22(15-19)29-21-8-4-3-5-9-21/h3-15,17,23-24H,1-2H3
52 atoms
Cl 2.362989 -6.036813 -3.212587
O  0.893513 0.708405 -0.045883
O  2.861744 -0.252431 0.357497
O  -2.844909 4.07839 0.37448
N  2.688747 2.854449 1.887997
C  0.845257 -1.57571 0.545233
C  0.968928 -1.96871 2.037011
C  1.25567 -2.680471 -0.401102
C  0.556717 -0.814417 2.945963
C  0.117143 -3.198505 2.324423
C  1.66515 -0.335516 0.277188
C  2.525691 -3.252138 -0.362255
C  0.338613 -3.16689 -1.326391
C  1.528511 1.958421 -0.280474
C  2.87178 -4.279618 -1.22548
C  0.667289 -4.197301 -2.195792
C  0.458743 2.933332 -0.701683
C  1.936755 -4.745771 -2.136995
C  -0.690611 3.050497 0.070917
C  0.624908 3.695116 -1.847597
C  -1.693494 3.916349 -0.335713
C  2.190315 2.433249 0.942608
C  -0.37339 4.585217 -2.221264
C  -1.537143 4.692237 -1.478919
C  -3.39006 3.013125 1.043561
C  -3.878336 3.245633 2.320391
C  -3.504096 1.757986 0.456697
C  -4.484163 2.208971 3.017346
C  -4.09764 0.727942 1.17083
C  -4.588332 0.945814 2.451933
H  -0.204732 -1.337943 0.354821
H  2.016048 -2.214017 2.239858
H  -0.463951 -0.485959 2.734759
H  0.590383 -1.126467 3.990898
H  1.213692 0.053537 2.858814
H  -0.938245 -3.005315 2.116625
H  0.199916 -3.479298 3.375601
H  0.420955 -4.062868 1.73315
H  3.264607 -2.907969 0.349182
H  -0.656388 -2.740863 -1.372222
H  2.292083 1.871261 -1.059588
H  3.862357 -4.71226 -1.182589
H  -0.062759 -4.563276 -2.905429
H  -0.802822 2.467677 0.977466
H  1.521845 3.596189 -2.445525
H  -0.252289 5.187042 -3.112144
H  -2.324258 5.371357 -1.781562
H  -3.788407 4.229935 2.763144
H  -3.137222 1.577738 -0.546122
H  -4.867129 2.392182 4.013036
H  -4.181103 -0.250845 0.715955
H  -5.05178 0.137926 3.002706
elementType: Cl O N C H
totalener: -1706.65814491 hartree
nucrepener: 2875.18187838 hartree
electener: -4581.84002328 hartree
oneelecener: -8044.47067363 hartree
twoeener: 3462.63065035 hartree
cpcmener: -0.03405248 hartree
kineticenergy: 1700.53118228 hartree
xcener: -142.754840244374 hartree
chargesum: -0.0000000
charge: -0.098687 -0.270878 -0.423627 -0.326883 -0.086486 0.143053 0.052859 -0.037446 -0.291520 -0.306577 0.348280 -0.199366 -0.156882 0.416984 -0.168427 -0.164257 0.011060 0.109908 -0.195077 -0.199662 0.238050 -0.233474 -0.114697 -0.226539 0.276827 -0.243857 -0.185149 -0.120928 -0.149708 -0.181372 0.075794 0.061990 0.090618 0.096425 0.091012 0.089673 0.098910 0.099225 0.141369 0.140360 0.131873 0.142340 0.142273 0.150385 0.146803 0.158891 0.148628 0.146545 0.156012 0.158162 0.159268 0.157918
qa: -0.0987 -0.2709 -0.4236 -0.3269 -0.0865 0.1431 0.0529 -0.0374 -0.2915 -0.3066 0.3483 -0.1994 -0.1569 0.4170 -0.1684 -0.1643 0.0111 0.1099 -0.1951 -0.1997 0.2381 -0.2335 -0.1147 -0.2265 0.2768 -0.2439 -0.1851 -0.1209 -0.1497 -0.1814 0.0758 0.0620 0.0906 0.0964 0.0910 0.0897 0.0989 0.0992 0.1414 0.1404 0.1319 0.1423 0.1423 0.1504 0.1468 0.1589 0.1486 0.1465 0.1560 0.1582 0.1593 0.1579
va: 1.2058 2.1727 2.0736 2.0841 3.1017 3.7065 3.8180 3.5676 3.9487 3.9369 4.2047 4.0153 3.9708 3.7565 4.0303 4.0062 3.7191 3.8209 3.9379 3.9548 3.7948 4.0117 3.9041 4.0080 3.6975 4.0119 3.9037 3.8830 3.8813 3.9054 1.0463 1.0213 1.0018 1.0062 1.0089 1.0019 1.0057 1.0008 1.0228 1.0035 1.0167 1.0068 1.0068 1.0107 1.0025 0.9895 1.0049 1.0075 0.9966 0.9890 0.9905 0.9905
dispcorr: -0.027745571 hartree
energy: -1706.685890477461
dipole: -14.16987 12.17972 -1.99015 4.34056 -4.60441 -0.26385 20.03864 -20.86458 -0.82594
magnitude: 2.17083 au
magnitude: 5.51781 debye
