program: Orca
programVersion: 5.0.2
elementType: Cl O O O N C C C C C C C C C C C C C C C C C C C C C C C C C H H H H H H H H H H H H H H H H H H H H H H
charge: 0
multiplicity: 1
keywords: wb97x-d3
keywords: def2-TZVPP
keywords: def2/J RIJCOSX
keywords: DEFGRID2
keywords: scfconv7
keywords: smallprint printgap noloewdin
keywords: NOSOSCF
formula: C25H22ClNO3
InChI: InChI=1/C25H22ClNO3/c1-17(2)24(18-11-13-20(26)14-12-18)25(28)30-23(16-27)19-7-6-10-22(15-19)29-21-8-4-3-5-9-21/h3-15,17,23-24H,1-2H3
52 atoms
Cl -2.637495 -2.859193 1.027276
O  2.910745 0.670365 0.675278
O  3.272501 0.265669 -1.490848
O  -2.125405 0.79049 0.225918
N  2.511596 3.253026 2.672442
C  3.176985 -1.580738 0.083741
C  3.910511 -2.513477 -0.8900
C  1.720167 -1.936637 0.309226
C  5.388929 -2.149406 -0.981294
C  3.758708 -3.963354 -0.442906
C  3.160063 -0.138124 -0.365644
C  0.810371 -1.928151 -0.745152
C  1.257942 -2.232854 1.585645
C  2.556493 2.014511 0.372469
C  -0.529728 -2.210533 -0.533371
C  -0.07946 -2.521017 1.814945
C  1.201924 2.103779 -0.291409
C  -0.964155 -2.50417 0.749896
C  0.120357 1.439631 0.273224
C  1.050682 2.838161 -1.458422
C  -1.118585 1.504292 -0.348176
C  2.539489 2.696992 1.667979
C  -0.195874 2.900383 -2.063117
C  -1.283364 2.233379 -1.521414
C  -3.42453 1.194271 0.042831
C  -4.31566 0.305023 -0.536365
C  -3.842913 2.446291 0.474784
C  -5.646553 0.675111 -0.679748
C  -5.172905 2.806299 0.318585
C  -6.078402 1.924395 -0.258317
H  3.68645 -1.62606 1.051973
H  3.461646 -2.410819 -1.882769
H  5.555069 -1.132461 -1.337326
H  5.87533 -2.244703 -0.007367
H  5.905289 -2.818667 -1.671267
H  4.313536 -4.626567 -1.108184
H  2.719675 -4.293792 -0.448301
H  4.148699 -4.109884 0.56753
H  1.136976 -1.692829 -1.750986
H  1.947691 -2.239672 2.420704
H  3.31794 2.497558 -0.248285
H  -1.223732 -2.1951 -1.362928
H  -0.421724 -2.750793 2.815065
H  0.226804 0.868705 1.189007
H  1.898078 3.350288 -1.895684
H  -0.322828 3.462471 -2.978921
H  -2.243454 2.278894 -2.019164
H  -3.975133 -0.668383 -0.865027
H  -3.139979 3.131321 0.933341
H  -6.345527 -0.018348 -1.129297
H  -5.50267 3.78045 0.655853
H  -7.115593 2.209795 -0.375501
elementType: Cl O N C H
totalener: -1706.65718273 hartree
nucrepener: 3027.94183668 hartree
electener: -4734.59901941 hartree
oneelecener: -8351.11016418 hartree
twoeener: 3616.51114478 hartree
cpcmener: -0.03227547 hartree
kineticenergy: 1700.54424229 hartree
xcener: -142.759526979859 hartree
chargesum: 0.0000000
charge: -0.099074 -0.273615 -0.411934 -0.312188 -0.085669 0.126771 0.065956 -0.052121 -0.292599 -0.310548 0.313628 -0.135086 -0.175439 0.402899 -0.211473 -0.155256 0.069308 0.135587 -0.293136 -0.192758 0.245484 -0.234724 -0.131998 -0.183019 0.245330 -0.211662 -0.172888 -0.142991 -0.148307 -0.164986 0.098551 0.044709 0.094665 0.088141 0.092954 0.098273 0.097841 0.090004 0.143688 0.138359 0.143393 0.145697 0.141855 0.142342 0.144232 0.159857 0.156171 0.133823 0.157359 0.158191 0.158278 0.158126
qa: -0.0991 -0.2736 -0.4119 -0.3122 -0.0857 0.1268 0.0660 -0.0521 -0.2926 -0.3105 0.3136 -0.1351 -0.1754 0.4029 -0.2115 -0.1553 0.0693 0.1356 -0.2931 -0.1928 0.2455 -0.2347 -0.1320 -0.1830 0.2453 -0.2117 -0.1729 -0.1430 -0.1483 -0.1650 0.0986 0.0447 0.0947 0.0881 0.0930 0.0983 0.0978 0.0900 0.1437 0.1384 0.1434 0.1457 0.1419 0.1423 0.1442 0.1599 0.1562 0.1338 0.1574 0.1582 0.1583 0.1581
va: 1.2064 2.1459 2.0880 2.0552 3.1115 3.6829 3.8131 3.4777 3.9286 3.9497 4.2682 3.8982 3.9911 3.7362 3.9872 4.0245 3.5582 3.7723 4.0445 3.9642 3.7447 4.0909 3.9207 3.9248 3.7127 3.9725 3.9438 3.9155 3.8968 3.8951 1.0363 1.0265 1.0144 1.0017 1.0046 1.0048 1.0007 1.0020 1.0134 1.0046 1.0123 1.0024 1.0068 1.0166 1.0033 0.9904 0.9981 1.0200 0.9966 0.9908 0.9901 0.9899
dispcorr: -0.032416200 hartree
energy: -1706.689598927730
dipole: 16.81398 -16.77784 0.03614 -6.73514 6.22351 -0.51163 -10.87185 9.49109 -1.38076
magnitude: 1.47295 au
magnitude: 3.74393 debye
