program: Gaussian 09
title: 000067736
version: EM64L-G09RevD.01
frameworkgroup: C1[X(C16F33I)]
method: RPBEPBE
basis: SDD
operation: Freq
keyword: #pfreq=noraman
keyword: PBEPBE/SDD
title: #p freq=noraman PBEPBE/SDD
converged: YES YES NO NO
title: Mulliken charges:
elementType: I F F F F F F F F F F F F F F F F F F F F F F F F F F F F F F F F F C C C C C C C C C C C C C C C C
charge: 0.221653 -0.114116 -0.119982 -0.116760 -0.114089 -0.115947 -0.124474 -0.118314 -0.112729 -0.116020 -0.121014 -0.113387 -0.130159 -0.117846 -0.117999 -0.112088 -0.117246 -0.121428 -0.120480 -0.109296 -0.123797 -0.122935 -0.121027 -0.113926 -0.121668 -0.128663 -0.120843 -0.121671 -0.121827 -0.119112 -0.114467 -0.119410 -0.122731 -0.125888 0.247421 0.248421 0.224036 0.238659 0.242115 0.192384 0.241285 0.244275 0.240000 0.236976 0.250967 0.266819 0.327834 0.208548 -0.075689 0.375636
chargesum: 0.00000
title: Mulliken charges with hydrogens summed into heavy atoms:
polarizability: 2.56236721e+02 -2.27986329e+00 1.87855446e+02 -1.60955720e+01 2.36751682e+00 1.87406809e+02
1716.lowfreq: -4.9891 -2.8787 -0.9270 -0.0008 -0.0004 0.0004 7.9052 12.3067 14.4519
frequency: 7.8335 12.2185 14.4061 17.0754 26.3123 32.6924 37.0984 41.3746 44.9716 48.6820 55.4302 62.8773 71.7391 77.7028 96.2251 98.6808 103.5010 111.0245 119.1921 124.3990 126.2005 130.1353 135.7282 136.7150 142.6588 151.7031 155.2114 167.9327 169.4991 176.0858 190.4489 197.9320 208.5067 213.9443 223.5890 229.1355 231.6511 235.1625 241.1528 244.1736 245.4625 250.5226 251.2515 255.4463 263.6516 266.5671 269.4325 277.6067 281.0955 282.7015 284.4973 289.2474 292.9489 295.5938 296.5726 300.4975 302.0491 303.9210 306.1063 309.8110 313.3893 318.4154 327.1376 331.0839 338.3298 340.0990 347.6780 364.9346 387.0353 398.8655 408.2299 417.5582 421.5939 430.8378 435.3701 445.2738 458.7552 463.3534 489.6285 511.9084 518.0590 533.8938 538.7703 546.5373 553.3470 557.0083 567.8614 570.9201 577.2128 577.6921 583.0892 588.6511 590.9615 593.4593 633.0010 654.0946 704.3607 777.8814 807.5177 834.2981 846.5780 876.7496 905.7209 926.2187 947.8393 967.5098 980.0879 982.2716 988.4694 994.8128 997.6218 1001.5133 1007.4382 1012.7355 1019.7777 1024.8974 1027.8862 1030.8623 1034.3519 1038.4917 1040.7583 1042.6888 1046.4166 1051.3537 1056.6562 1065.2971 1067.7637 1079.2302 1082.3160 1086.4304 1099.6187 1104.5200 1112.3042 1120.6429 1123.6842 1125.7991 1129.9471 1134.1893 1145.3918 1148.4426 1155.4271 1167.0074 1183.4850 1189.2891
redmass: 20.9329 20.7752 19.6984 23.7992 19.0852 19.2430 18.1515 18.1746 18.6666 19.1770 19.9970 18.4572 18.8994 19.1385 20.5328 18.3676 18.4879 19.0034 18.3698 18.5551 18.1094 18.0480 18.4067 18.3312 18.0644 17.8731 17.9592 18.0941 18.1330 18.1878 17.2187 17.9716 17.6892 18.2305 18.0653 18.7752 19.4147 19.5886 19.2157 18.6742 18.6919 18.6162 18.8765 18.7875 19.1075 18.3275 19.0663 18.5778 18.4166 18.6219 18.5345 18.8495 18.5053 18.8301 18.6292 18.7022 18.7904 18.7968 18.8231 18.7454 18.7312 18.5651 18.3718 18.6682 18.6753 18.6392 18.1655 17.7876 17.7080 17.8081 17.8524 17.8645 17.8135 17.6734 17.5599 17.4072 17.2738 17.8409 17.2136 17.3414 17.3881 16.8431 16.8156 16.7927 17.0015 17.0313 17.2063 17.2804 17.4281 17.4247 17.4746 17.6202 17.6488 17.6759 17.7922 17.1487 13.8750 13.0472 13.3053 13.4759 13.5634 13.5468 13.4734 13.5420 13.5982 13.6153 13.7082 13.6894 13.4080 13.4202 13.2419 13.2863 13.4050 13.3074 13.1193 13.1194 13.2156 13.0408 12.9943 12.9161 12.9948 13.1842 13.0291 12.9475 13.2164 13.2745 13.2983 13.0190 13.0165 13.2919 12.9097 12.7642 12.5100 12.4163 12.3162 12.5538 12.2211 12.1560 12.0782 12.2066 12.0445 12.2937 12.1283 12.3218
irintensity: 0.0346 0.0368 0.0630 0.1274 0.0845 0.0332 0.0253 0.0253 0.0502 0.0160 0.0391 0.0653 0.1860 0.1068 0.5425 0.1099 0.5111 0.3990 0.2107 0.3651 0.6907 1.3990 1.0806 0.3000 2.5964 1.7005 0.2051 0.3191 2.6276 2.8317 56.7829 7.5185 2.0903 6.8151 0.1211 0.3404 1.5914 0.7024 0.0451 0.8043 0.4135 0.6782 0.8128 0.5951 0.4109 0.1822 0.6441 0.1090 3.4572 0.7973 0.8849 1.9145 0.6361 0.3157 0.1042 0.3330 0.3095 0.0125 0.2701 0.2007 0.2361 1.2699 2.8688 1.0125 0.0223 0.1246 1.5408 0.8162 4.1312 2.8685 15.8322 4.6931 1.7957 1.1149 1.5830 0.4203 0.4251 8.0244 11.8918 2.8868 11.2972 9.2623 8.1683 12.2751 18.6389 23.9633 3.3657 0.9395 10.0185 8.4165 2.0302 1.6574 0.1885 0.2358 2.3424 52.4390 296.1138 504.4339 79.9349 77.6543 51.3849 16.9971 175.6912 44.2946 78.6516 12.3707 57.2381 9.9128 8.5738 250.7394 88.2373 100.0588 34.4079 75.9156 19.4811 18.1733 53.7770 8.7065 58.8398 29.5747 8.0998 69.2837 123.7474 111.9348 295.0262 152.3609 262.0346 190.8545 178.4497 401.5493 23.4569 7.9805 10.4033 22.4449 53.5514 47.7573 28.5544 8.8231 0.6565 5.8199 0.7102 2.8720 2.8378 42.4214
temp: 298.150 k
press: 1.00000 atm
elementType: 53 9 9 9 9 9 9 9 9 9 9 9 9 9 9 9 9 9 9 9 9 9 9 9 9 9 9 9 9 9 9 9 9 9 6 6 6 6 6 6 6 6 6 6 6 6 6 6 6 6
symmnumber: 1
zpe: 460350.4 jmol-1
zpe.correction: 0.175338 hartree
zpe.thermalcorrener: 0.226005 hartree
zpe.thermalcorrenthalpy: 0.226949 hartree
zpe.thermalcorrgfe: 0.086505 hartree
zpe.sumelectzpe: -3911.965701 hartree
zpe.sumelectthermal: -3911.915034 hartree
zpe.sumelectthermalent: -3911.914090 hartree
zpe.sumelectthermalfe: -3912.054534 hartree
dipole: 1.6958 -0.2556 -0.9446
dipole: 1.9578
quadrupole: -276.1582 -302.1190 -300.8172
quadrupole: -3.4482 -9.5679 -0.0358
quadrupole: 16.8732 -9.0875 -7.7857 -3.4482 -9.5679 -0.0358
hfenergy: -3912.1410389 hartree
pointgroup: C01 [X(C16F33I1)]
dipole: -0.6633892 0.060995 -0.3866791 debye
polarizability: 255.8863043|-0.3458996|187.3935101|16.9808483|-2.2868794|188.2191611 unknown
InChI: InChI=1S/C16F33I/c17-1(18,3(21,22)5(25,26)7(29,30)9(33,34)11(37,38)13(41,42)15(45,46)47)2(19,20)4(23,24)6(27,28)8(31,32)10(35,36)12(39,40)14(43,44)16(48,49)50
charge 0 multiplicity 1
50 atoms
I  -9.044492 -0.526278 -0.479893
F  0.307802 0.683322 -2.316167
F  -1.534386 1.949104 -1.922434
F  -0.531495 3.076038 0.261143
F  0.872217 3.176809 -1.541433
F  -1.704764 -0.822776 -1.536134
F  -0.081504 -0.726216 0.059686
F  1.136623 1.233927 1.526446
F  2.001356 3.263104 0.934245
F  -2.498071 -1.106665 1.092453
F  -1.62155 0.924495 1.643278
F  3.506322 2.218854 -1.038056
F  2.469621 0.183848 -0.929388
F  -3.365274 2.252669 0.040034
F  -4.290725 0.871851 1.59722
F  3.429023 -0.415855 1.459818
F  3.970304 1.743567 1.958841
F  -5.73093 1.315308 -0.729535
F  -4.022201 0.513979 -2.004242
F  5.94517 1.827079 0.107001
F  6.108695 0.133902 1.625089
F  -4.228608 -1.985223 -0.841239
F  -6.078778 -1.149568 -1.875465
F  7.17936 -0.277285 -0.908092
F  5.127548 0.008621 -1.868919
F  -5.30183 -1.708966 1.622815
F  -6.599355 -2.861511 0.14015
F  4.108966 -2.189287 -0.575505
F  6.029515 -2.552764 -1.756083
F  -7.043302 0.482588 1.497862
F  -7.951193 -1.509651 2.093427
F  6.019404 -4.15196 0.36128
F  7.462138 -2.466125 0.830668
F  5.412804 -2.529653 1.815864
C  -0.490127 1.230977 -1.289395
C  0.373416 2.325093 -0.526291
C  -1.141658 0.001457 -0.537584
C  1.597842 2.002396 0.435575
C  -2.23124 0.189544 0.597509
C  2.876461 1.304468 -0.170582
C  -3.628295 0.898052 0.347525
C  3.911774 0.793302 0.913355
C  -4.655725 0.393428 -0.744883
C  5.415808 0.570231 0.466685
C  -5.286838 -1.055725 -0.704654
C  5.790633 -0.429295 -0.696574
C  -6.168129 -1.563755 0.508858
C  5.505152 -1.979789 -0.575068
C  -7.442846 -0.775034 0.996581
C  6.115265 -2.784932 0.634311
