program: Orca
programVersion: 5.0.2
elementType: Cl O O O N C C C C C C C C C C C C C C C C C C C C C C C C C H H H H H H H H H H H H H H H H H H H H H H
charge: 0
multiplicity: 1
keywords: wb97x-d3
keywords: def2-TZVPP
keywords: def2/J RIJCOSX
keywords: DEFGRID2
keywords: scfconv7
keywords: smallprint printgap noloewdin
keywords: NOSOSCF
formula: C25H22ClNO3
InChI: InChI=1/C25H22ClNO3/c1-17(2)24(18-11-13-20(26)14-12-18)25(28)30-23(16-27)19-7-6-10-22(15-19)29-21-8-4-3-5-9-21/h3-15,17,23-24H,1-2H3
52 atoms
Cl 2.438391 -5.342549 3.964152
O  0.976622 0.174514 0.349849
O  2.960361 0.48378 -0.624954
O  -2.353223 3.133327 -2.427059
N  -0.729974 1.56923 2.791048
C  1.893284 -1.676628 -0.793038
C  0.624957 -1.917759 -1.639887
C  2.005766 -2.576561 0.419528
C  0.59009 -0.972583 -2.83652
C  0.579684 -3.365983 -2.110489
C  2.029708 -0.231301 -0.369788
C  0.976523 -2.709355 1.349627
C  3.169779 -3.312708 0.613657
C  0.970108 1.523095 0.807754
C  1.10553 -3.553925 2.440572
C  3.315531 -4.163983 1.699111
C  0.534277 2.483298 -0.272119
C  2.276523 -4.2776 2.606385
C  -0.731237 2.344691 -0.831472
C  1.398165 3.475336 -0.712122
C  -1.136023 3.22861 -1.820569
C  0.016943 1.533877 1.919877
C  0.985184 4.340508 -1.715738
C  -0.279385 4.226993 -2.268452
C  -3.462693 2.799493 -1.69482
C  -4.375289 1.93648 -2.284416
C  -3.707699 3.343034 -0.439209
C  -5.546849 1.619014 -1.611267
C  -4.877588 3.007137 0.226269
C  -5.800781 2.146211 -0.352766
H  2.756812 -1.8729 -1.43422
H  -0.258095 -1.729271 -1.022188
H  -0.289962 -1.168938 -3.450465
H  0.543847 0.079747 -2.547956
H  1.470617 -1.105527 -3.469103
H  1.454949 -3.610955 -2.716834
H  -0.305471 -3.538126 -2.724429
H  0.541507 -4.072199 -1.280642
H  0.049277 -2.164038 1.232493
H  3.982218 -3.230209 -0.098033
H  1.949087 1.811063 1.203759
H  0.29524 -3.646012 3.151363
H  4.227855 -4.731116 1.82689
H  -1.397552 1.558467 -0.49399
H  2.383255 3.575203 -0.275238
H  1.651933 5.11715 -2.066266
H  -0.606055 4.908672 -3.043626
H  -4.17175 1.52268 -3.264333
H  -3.002694 4.025031 0.019809
H  -6.259435 0.948395 -2.074097
H  -5.068018 3.429437 1.204648
H  -6.712188 1.891601 0.171887
elementType: Cl O N C H
totalener: -1706.65723632 hartree
nucrepener: 2891.04015758 hartree
electener: -4597.69739390 hartree
oneelecener: -8076.46136896 hartree
twoeener: 3478.76397505 hartree
cpcmener: -0.03200455 hartree
kineticenergy: 1700.53148488 hartree
xcener: -142.755166778355 hartree
chargesum: 0.0000000
charge: -0.098454 -0.268532 -0.416044 -0.329107 -0.085398 0.178227 0.032267 -0.047128 -0.292297 -0.303952 0.327091 -0.205111 -0.176842 0.403593 -0.155466 -0.156011 0.070984 0.104806 -0.264314 -0.198468 0.255570 -0.237497 -0.112878 -0.229826 0.277980 -0.247247 -0.185177 -0.121175 -0.143717 -0.184382 0.091893 0.057818 0.095221 0.089082 0.097185 0.091081 0.098369 0.099458 0.140066 0.139997 0.143218 0.142840 0.143073 0.149674 0.145700 0.159040 0.148127 0.146189 0.154618 0.158131 0.159759 0.157966
qa: -0.0985 -0.2685 -0.4160 -0.3291 -0.0854 0.1782 0.0323 -0.0471 -0.2923 -0.3040 0.3271 -0.2051 -0.1768 0.4036 -0.1555 -0.1560 0.0710 0.1048 -0.2643 -0.1985 0.2556 -0.2375 -0.1129 -0.2298 0.2780 -0.2472 -0.1852 -0.1212 -0.1437 -0.1844 0.0919 0.0578 0.0952 0.0891 0.0972 0.0911 0.0984 0.0995 0.1401 0.1400 0.1432 0.1428 0.1431 0.1497 0.1457 0.1590 0.1481 0.1462 0.1546 0.1581 0.1598 0.1580
va: 1.2059 2.1269 2.0932 2.0786 3.1056 3.6187 3.8281 3.5800 3.9472 3.9351 4.2443 3.9921 4.0031 3.7582 4.0181 3.9945 3.5188 3.8253 3.9283 3.9673 3.7581 4.0730 3.9008 4.0182 3.6962 4.0101 3.9010 3.8851 3.8945 3.9063 1.0333 1.0213 1.0043 1.0047 1.0050 1.0023 1.0047 1.0012 1.0151 1.0042 1.0131 1.0067 1.0063 1.0104 1.0068 0.9891 1.0045 1.0081 0.9985 0.9890 0.9901 0.9905
dispcorr: -0.028792906 hartree
energy: -1706.686029224870
dipole: -9.84475 9.86815 0.02340 5.25103 -5.06826 0.18277 -25.13936 23.53306 -1.60630
magnitude: 1.61684 au
magnitude: 4.10968 debye
