program: Orca
programVersion: 5.0.2
elementType: Cl O O O N C C C C C C C C C C C C C C C C C C C C C C C C C H H H H H H H H H H H H H H H H H H H H H H
charge: 0
multiplicity: 1
keywords: wb97x-d3
keywords: def2-TZVPP
keywords: def2/J RIJCOSX
keywords: DEFGRID2
keywords: scfconv7
keywords: smallprint printgap noloewdin
keywords: NOSOSCF
formula: C25H22ClNO3
InChI: InChI=1/C25H22ClNO3/c1-17(2)24(18-11-13-20(26)14-12-18)25(28)30-23(16-27)19-7-6-10-22(15-19)29-21-8-4-3-5-9-21/h3-15,17,23-24H,1-2H3
52 atoms
Cl -3.08202 -2.505988 0.774527
O  2.997241 0.671594 0.566153
O  2.973036 0.151556 -1.60511
O  -1.92493 1.386548 0.807882
N  3.501869 3.377764 2.388263
C  2.835229 -1.614767 0.047558
C  3.522907 -2.638401 -0.868199
C  1.345964 -1.844139 0.222818
C  5.021513 -2.366498 -0.950589
C  3.27378 -4.051137 -0.352729
C  2.965252 -0.196724 -0.456159
C  0.487004 -1.853999 -0.87346
C  0.80717 -2.022481 1.491596
C  2.839749 2.04424 0.241204
C  -0.874204 -2.054872 -0.711197
C  -0.554215 -2.218731 1.672011
C  1.415439 2.379845 -0.141847
C  -1.385902 -2.236917 0.564873
C  0.361472 1.716311 0.471876
C  1.172504 3.36519 -1.087177
C  -0.942148 2.0460 0.133828
C  3.218058 2.773704 1.453277
C  -0.137603 3.69963 -1.398453
C  -1.201371 3.050693 -0.79191
C  -3.094057 1.027214 0.194725
C  -4.228502 1.007778 0.993801
C  -3.156486 0.627468 -1.134039
C  -5.432834 0.574514 0.46108
C  -4.37122 0.206525 -1.65566
C  -5.511944 0.174686 -0.865808
H  3.30318 -1.67104 1.035073
H  3.097576 -2.556693 -1.873088
H  5.486109 -2.426869 0.03664
H  5.509817 -3.105038 -1.587906
H  5.250998 -1.3846 -1.366255
H  3.797042 -4.780236 -0.972654
H  2.216425 -4.317146 -0.362477
H  3.637112 -4.169375 0.67097
H  0.873108 -1.709671 -1.874997
H  1.455403 -2.012653 2.359112
H  3.529503 2.349712 -0.552499
H  -1.526665 -2.069776 -1.573444
H  -0.95484 -2.359376 2.666917
H  0.532306 0.947718 1.215965
H  1.996426 3.871018 -1.574584
H  -0.335633 4.476113 -2.125383
H  -2.217362 3.329038 -1.040803
H  -4.162605 1.318567 2.029194
H  -2.274028 0.630638 -1.760862
H  -6.314089 0.555346 1.08935
H  -4.418923 -0.107489 -2.690606
H  -6.453644 -0.15968 -1.280919
elementType: Cl O N C H
totalener: -1706.65700523 hartree
nucrepener: 3071.77600073 hartree
electener: -4778.43300596 hartree
oneelecener: -8438.53009639 hartree
twoeener: 3660.09709043 hartree
cpcmener: -0.03233742 hartree
kineticenergy: 1700.55214244 hartree
xcener: -142.764550306058 hartree
chargesum: -0.0000000
charge: -0.096961 -0.277996 -0.416392 -0.322566 -0.085897 0.146587 0.059572 -0.025395 -0.292423 -0.311668 0.320162 -0.175082 -0.205025 0.382081 -0.192520 -0.136079 0.043878 0.131488 -0.258364 -0.200754 0.262684 -0.227877 -0.123772 -0.193865 0.353990 -0.283636 -0.238978 -0.104790 -0.137375 -0.195137 0.093529 0.048498 0.089904 0.093135 0.095783 0.098216 0.098463 0.090258 0.141225 0.137402 0.146731 0.144254 0.141216 0.152839 0.144016 0.160446 0.157476 0.142731 0.153676 0.157052 0.158163 0.157099
qa: -0.0970 -0.2780 -0.4164 -0.3226 -0.0859 0.1466 0.0596 -0.0254 -0.2924 -0.3117 0.3202 -0.1751 -0.2050 0.3821 -0.1925 -0.1361 0.0439 0.1315 -0.2584 -0.2008 0.2627 -0.2279 -0.1238 -0.1939 0.3540 -0.2836 -0.2390 -0.1048 -0.1374 -0.1951 0.0935 0.0485 0.0899 0.0931 0.0958 0.0982 0.0985 0.0903 0.1412 0.1374 0.1467 0.1443 0.1412 0.1528 0.1440 0.1604 0.1575 0.1427 0.1537 0.1571 0.1582 0.1571
va: 1.2114 2.1402 2.0811 2.0481 3.1129 3.6668 3.8135 3.4499 3.9264 3.9505 4.2434 3.9641 3.9799 3.7349 4.0035 3.9977 3.6271 3.7751 4.0276 3.9898 3.7795 4.0793 3.8922 3.9315 3.5076 4.0334 3.8781 3.8638 3.8995 3.9182 1.0400 1.0256 1.0020 1.0046 1.0121 1.0047 1.0004 1.0022 1.0186 1.0053 1.0152 1.0029 1.0068 1.0102 1.0022 0.9900 0.9957 1.0100 0.9990 0.9880 0.9892 0.9897
dispcorr: -0.033934159 hartree
energy: -1706.690939392265
dipole: 15.63228 -15.77522 -0.14294 -10.87263 9.97662 -0.89601 -10.31954 8.96177 -1.35776
magnitude: 1.63303 au
magnitude: 4.15083 debye
