program: Orca
programVersion: 5.0.2
elementType: Cl O O O N C C C C C C C C C C C C C C C C C C C C C C C C C H H H H H H H H H H H H H H H H H H H H H H
charge: 0
multiplicity: 1
keywords: wb97x-d3
keywords: def2-TZVPP
keywords: def2/J RIJCOSX
keywords: DEFGRID2
keywords: scfconv7
keywords: smallprint printgap noloewdin
keywords: NOSOSCF
formula: C25H22ClNO3
InChI: InChI=1/C25H22ClNO3/c1-17(2)24(18-11-13-20(26)14-12-18)25(28)30-23(16-27)19-7-6-10-22(15-19)29-21-8-4-3-5-9-21/h3-15,17,23-24H,1-2H3
52 atoms
Cl -2.604366 -1.958314 1.631854
O  3.098709 0.716762 0.159515
O  2.925784 -0.125643 -1.914214
O  -2.076639 0.514608 -1.018612
N  3.79475 3.886821 0.895046
C  3.172131 -1.620656 -0.03087
C  3.767011 -2.731708 -0.900768
C  1.734768 -1.825785 0.415095
C  5.215001 -2.413252 -1.262003
C  3.683513 -4.073755 -0.181912
C  3.089722 -0.284494 -0.738971
C  0.760944 -2.267853 -0.475022
C  1.339374 -1.435716 1.68899
C  2.458034 1.936919 -0.213049
C  -0.570979 -2.332202 -0.102053
C  0.010481 -1.484342 2.074276
C  1.023088 1.878864 0.251353
C  -0.93828 -1.930936 1.171169
C  0.08174 1.309967 -0.596739
C  0.655885 2.284145 1.527549
C  -1.222859 1.131164 -0.160526
C  3.215031 3.020738 0.412513
C  -0.653678 2.111554 1.946724
C  -1.597542 1.529001 1.117349
C  -3.396957 0.869517 -1.037983
C  -4.337391 -0.14815 -1.061282
C  -3.792763 2.199953 -1.093597
C  -5.684482 0.169965 -1.144779
C  -5.143201 2.503754 -1.164739
C  -6.094111 1.493828 -1.190647
H  3.794166 -1.507329 0.863128
H  3.197104 -2.795875 -1.831804
H  5.307104 -1.492352 -1.836966
H  5.831628 -2.315866 -0.365332
H  5.643862 -3.213886 -1.865224
H  2.657383 -4.358041 0.049023
H  4.2394 -4.050839 0.75841
H  4.115137 -4.863995 -0.796874
H  1.031622 -2.551039 -1.483962
H  2.076486 -1.067892 2.391369
H  2.506307 2.07808 -1.296925
H  -1.319039 -2.668568 -0.805717
H  -0.284518 -1.162363 3.062882
H  0.352454 0.991954 -1.595855
H  1.380045 2.737827 2.191859
H  -0.944084 2.426643 2.940039
H  -2.611256 1.378865 1.464115
H  -4.011589 -1.178109 -1.010813
H  -3.054967 2.992176 -1.086075
H  -6.41723 -0.625785 -1.164546
H  -5.451593 3.539943 -1.207922
H  -7.146174 1.737432 -1.249399
totalener: -1706.62815623 hartree
nucrepener: 3083.08393959 hartree
electener: -4789.71209582 hartree
oneelecener: -8460.44974389 hartree
twoeener: 3670.73764807 hartree
kineticenergy: 1700.62321287 hartree
xcener: -142.775612671945 hartree
chargesum: -0.0000000
charge: -0.086033 -0.256575 -0.341119 -0.290981 -0.002898 0.083442 0.040316 0.035062 -0.282070 -0.269651 0.280780 -0.199781 -0.189451 0.289111 -0.112969 -0.130825 0.053026 0.119169 -0.227528 -0.154319 0.239053 -0.259392 -0.124224 -0.164078 0.254424 -0.200421 -0.152876 -0.107815 -0.124372 -0.134884 0.090591 0.045461 0.103663 0.082330 0.085438 0.100367 0.080521 0.089023 0.127306 0.109204 0.130906 0.117056 0.117672 0.128699 0.120616 0.130475 0.133510 0.113649 0.130677 0.126269 0.127912 0.126535
qa: -0.0860 -0.2566 -0.3411 -0.2910 -0.0029 0.0834 0.0403 0.0351 -0.2821 -0.2697 0.2808 -0.1998 -0.1895 0.2891 -0.1130 -0.1308 0.0530 0.1192 -0.2275 -0.1543 0.2391 -0.2594 -0.1242 -0.1641 0.2544 -0.2004 -0.1529 -0.1078 -0.1244 -0.1349 0.0906 0.0455 0.1037 0.0823 0.0854 0.1004 0.0805 0.0890 0.1273 0.1092 0.1309 0.1171 0.1177 0.1287 0.1206 0.1305 0.1335 0.1136 0.1307 0.1263 0.1279 0.1265
va: 1.2276 2.1244 2.1516 2.0601 3.1160 3.7043 3.8413 3.5625 3.9383 3.9366 4.2939 4.0168 4.0504 3.8380 3.9794 3.9592 3.6452 3.8628 4.0063 3.9919 3.7063 4.0351 3.9542 3.9136 3.7832 4.0176 3.9506 3.9793 3.9547 3.9583 1.0318 1.0266 1.0125 1.0047 1.0063 1.0055 1.0049 1.0076 1.0135 1.0182 1.0207 1.0101 1.0142 1.0298 1.0189 1.0004 1.0149 1.0275 1.0056 1.0001 1.0000 0.9999
dispcorr: -0.035183365 hartree
energy: -1706.663339596844
dipole: 13.96791 -14.85774 -0.88983 -11.63792 10.65089 -0.98703 -6.46716 6.61133 0.14417
magnitude: 1.33672 au
magnitude: 3.39767 debye
