program: Orca
programVersion: 5.0.2
elementType: Cl O O O N C C C C C C C C C C C C C C C C C C C C C C C C C H H H H H H H H H H H H H H H H H H H H H H
charge: 0
multiplicity: 1
keywords: wb97x-d3
keywords: def2-TZVPP
keywords: def2/J RIJCOSX
keywords: DEFGRID2
keywords: scfconv7
keywords: smallprint printgap noloewdin
keywords: NOSOSCF
formula: C25H22ClNO3
InChI: InChI=1/C25H22ClNO3/c1-17(2)24(18-11-13-20(26)14-12-18)25(28)30-23(16-27)19-7-6-10-22(15-19)29-21-8-4-3-5-9-21/h3-15,17,23-24H,1-2H3
52 atoms
Cl -2.073055 -3.523767 3.135291
O  1.945469 0.540042 -0.323832
O  3.890951 -0.25174 0.433179
O  -2.420353 3.064782 -0.709067
N  2.159452 1.864536 2.798721
C  2.319507 -1.772226 -0.602548
C  1.945161 -1.755673 -2.097081
C  1.196267 -2.211034 0.314148
C  3.098596 -1.233626 -2.948703
C  1.54449 -3.156328 -2.546045
C  2.84132 -0.440332 -0.106914
C  1.456066 -3.118886 1.333732
C  -0.09726 -1.7106 0.191844
C  2.243748 1.828821 0.183295
C  0.461025 -3.528873 2.207598
C  -1.102921 -2.109664 1.055022
C  1.210667 2.780133 -0.365433
C  -0.817782 -3.019931 2.060242
C  -0.135379 2.450606 -0.268574
C  1.60359 3.973584 -0.948828
C  -1.086761 3.31747 -0.783327
C  2.204719 1.8243 1.651772
C  0.639323 4.845534 -1.436237
C  -0.702769 4.520804 -1.365359
C  -2.874069 1.777215 -0.771812
C  -3.816125 1.37916 0.163751
C  -2.455266 0.904413 -1.769661
C  -4.350425 0.100994 0.093809
C  -2.989453 -0.373435 -1.821795
C  -3.937878 -0.781457 -0.89345
H  3.152697 -2.470264 -0.477994
H  1.089567 -1.08964 -2.241726
H  3.348702 -0.195559 -2.725474
H  4.00031 -1.832165 -2.804092
H  2.842327 -1.278767 -4.007722
H  1.261852 -3.155285 -3.599416
H  0.700515 -3.54495 -1.977317
H  2.374362 -3.857168 -2.430637
H  2.456589 -3.515486 1.455316
H  -0.346257 -1.000519 -0.585943
H  3.247312 2.143693 -0.120668
H  0.681575 -4.236474 2.99451
H  -2.100712 -1.709019 0.941506
H  -0.438439 1.528306 0.211659
H  2.653188 4.227455 -1.023822
H  0.938733 5.78035 -1.890275
H  -1.458596 5.18985 -1.754739
H  -4.129078 2.070928 0.934455
H  -1.727075 1.222268 -2.505122
H  -5.087601 -0.206985 0.823204
H  -2.666931 -1.052564 -2.600305
H  -4.353447 -1.77878 -0.941921
totalener: -1706.62909359 hartree
nucrepener: 3028.01916605 hartree
electener: -4734.64825964 hartree
oneelecener: -8349.98876468 hartree
twoeener: 3615.34050504 hartree
kineticenergy: 1700.60669478 hartree
xcener: -142.767425002162 hartree
chargesum: -0.0000000
charge: -0.074335 -0.266991 -0.314741 -0.297087 0.007439 0.115618 0.000834 -0.005291 -0.268498 -0.267052 0.280900 -0.135339 -0.215943 0.283525 -0.127222 -0.076782 0.056732 0.073577 -0.162620 -0.170299 0.199176 -0.246765 -0.085933 -0.199447 0.251930 -0.193562 -0.175570 -0.079641 -0.122983 -0.184207 0.089054 0.045144 0.085309 0.093504 0.086092 0.087528 0.101882 0.082916 0.112837 0.092806 0.112589 0.119163 0.116989 0.131559 0.113691 0.128939 0.130936 0.129723 0.134115 0.133540 0.132582 0.139679
qa: -0.0743 -0.2670 -0.3147 -0.2971 0.0074 0.1156 0.0008 -0.0053 -0.2685 -0.2671 0.2809 -0.1353 -0.2159 0.2835 -0.1272 -0.0768 0.0567 0.0736 -0.1626 -0.1703 0.1992 -0.2468 -0.0859 -0.1994 0.2519 -0.1936 -0.1756 -0.0796 -0.1230 -0.1842 0.0891 0.0451 0.0853 0.0935 0.0861 0.0875 0.1019 0.0829 0.1128 0.0928 0.1126 0.1192 0.1170 0.1316 0.1137 0.1289 0.1309 0.1297 0.1341 0.1335 0.1326 0.1397
va: 1.2363 2.1210 2.1893 2.1198 3.1162 3.6659 3.8852 3.6275 3.9457 3.9259 4.2514 4.0214 4.0403 3.8894 4.0139 3.9592 3.7228 3.9837 3.9522 4.0053 3.8868 3.9765 3.9628 4.0391 3.7917 4.0394 3.9099 3.8761 3.8540 3.9133 1.0310 1.0162 1.0125 1.0064 1.0051 1.0074 1.0051 1.0060 1.0117 1.0204 1.0239 1.0140 1.0258 1.0213 1.0111 0.9998 1.0111 1.0122 1.0040 0.9976 0.9998 0.9977
dispcorr: -0.031949415 hartree
energy: -1706.661043005509
dipole: 8.94813 -9.35426 -0.40613 -3.42712 3.37474 -0.05237 -27.13898 24.90482 -2.23416
magnitude: 2.27138 au
magnitude: 5.77338 debye
