program: Orca
programVersion: 5.0.2
elementType: Cl O O O N C C C C C C C C C C C C C C C C C C C C C C C C C H H H H H H H H H H H H H H H H H H H H H H
charge: 0
multiplicity: 1
keywords: wb97x-d3
keywords: def2-TZVPP
keywords: def2/J RIJCOSX
keywords: DEFGRID2
keywords: scfconv7
keywords: smallprint printgap noloewdin
keywords: NOSOSCF
formula: C25H22ClNO3
InChI: InChI=1/C25H22ClNO3/c1-17(2)24(18-11-13-20(26)14-12-18)25(28)30-23(16-27)19-7-6-10-22(15-19)29-21-8-4-3-5-9-21/h3-15,17,23-24H,1-2H3
52 atoms
Cl -2.919726 -4.300043 0.934075
O  2.38792 0.883603 -0.004669
O  1.679799 -0.170141 -1.853843
O  -2.531659 3.132342 0.234782
N  4.514993 3.355989 -0.59898
C  2.328122 -1.472201 0.065039
C  3.391763 -2.347143 -0.633444
C  1.007304 -2.178916 0.267627
C  4.689268 -1.572249 -0.84419
C  3.650724 -3.609301 0.179988
C  2.088123 -0.205996 -0.728143
C  0.30904 -2.737926 -0.799796
C  0.464373 -2.287868 1.541844
C  2.189534 2.165354 -0.603726
C  -0.889163 -3.400268 -0.597641
C  -0.73831 -2.943545 1.760909
C  1.124358 2.904749 0.163549
C  -1.40626 -3.50111 0.684729
C  -0.200852 2.667998 -0.184562
C  1.436551 3.746719 1.220321
C  -1.217984 3.277005 0.538569
C  3.489086 2.839729 -0.593939
C  0.411532 4.360425 1.924853
C  -0.911079 4.126574 1.595471
C  -3.00133 1.96354 -0.300734
C  -3.874835 2.061134 -1.372875
C  -2.680724 0.72611 0.243113
C  -4.439585 0.909415 -1.899755
C  -3.247109 -0.417022 -0.297799
C  -4.126374 -0.332263 -1.367838
H  2.721957 -1.192274 1.046234
H  3.003077 -2.637013 -1.614318
H  4.566253 -0.713101 -1.504782
H  5.093941 -1.209911 0.102958
H  5.445224 -2.213132 -1.298508
H  2.74875 -4.205125 0.31625
H  4.04264 -3.36462 1.169872
H  4.389857 -4.237941 -0.317244
H  0.693481 -2.652365 -1.806952
H  0.987439 -1.855653 2.386191
H  1.885581 2.048019 -1.647986
H  -1.422924 -3.829512 -1.434205
H  -1.147808 -3.020738 2.758586
H  -0.434897 2.013908 -1.016628
H  2.467382 3.935064 1.490511
H  0.646649 5.023773 2.74607
H  -1.713357 4.601787 2.144288
H  -4.114857 3.034906 -1.779319
H  -2.004213 0.649844 1.085228
H  -5.125538 0.986881 -2.733101
H  -3.006157 -1.379626 0.130283
H  -4.567926 -1.229826 -1.778977
totalener: -1706.63211556 hartree
nucrepener: 2978.02964780 hartree
electener: -4684.66176336 hartree
oneelecener: -8250.01863186 hartree
twoeener: 3565.35686850 hartree
kineticenergy: 1700.60122233 hartree
xcener: -142.765086244510 hartree
chargesum: -0.0000000
charge: -0.082039 -0.246892 -0.359289 -0.296080 -0.001725 0.090424 0.018090 -0.028061 -0.267542 -0.277604 0.320148 -0.134142 -0.149312 0.289152 -0.157947 -0.128324 0.009676 0.076602 -0.153629 -0.174432 0.221093 -0.259469 -0.087045 -0.203078 0.264946 -0.220664 -0.216552 -0.069016 -0.054191 -0.180106 0.073047 0.059546 0.095395 0.089426 0.087040 0.100787 0.079863 0.091814 0.126044 0.112477 0.131457 0.121504 0.122630 0.135354 0.123623 0.130008 0.128949 0.125900 0.127733 0.125823 0.145101 0.123488
qa: -0.0820 -0.2469 -0.3593 -0.2961 -0.0017 0.0904 0.0181 -0.0281 -0.2675 -0.2776 0.3201 -0.1341 -0.1493 0.2892 -0.1579 -0.1283 0.0097 0.0766 -0.1536 -0.1744 0.2211 -0.2595 -0.0870 -0.2031 0.2649 -0.2207 -0.2166 -0.0690 -0.0542 -0.1801 0.0730 0.0595 0.0954 0.0894 0.0870 0.1008 0.0799 0.0918 0.1260 0.1125 0.1315 0.1215 0.1226 0.1354 0.1236 0.1300 0.1289 0.1259 0.1277 0.1258 0.1451 0.1235
va: 1.2210 2.1236 2.1398 2.1152 3.1148 3.7465 3.8542 3.6057 3.9420 3.9359 4.2363 4.0090 3.9975 3.8303 4.0232 3.9992 3.7741 3.9010 3.8969 4.0335 3.8615 4.0300 3.9550 4.0442 3.7805 4.0553 3.9987 3.9147 3.8586 4.0041 1.0454 1.0203 1.0128 1.0052 1.0057 1.0039 1.0052 1.0082 1.0259 1.0114 1.0317 1.0140 1.0130 1.0164 1.0194 0.9995 1.0122 1.0137 1.0079 0.9986 0.9903 1.0042
dispcorr: -0.030341342 hartree
energy: -1706.662456905330
dipole: 18.28860 -18.75328 -0.46468 -4.96193 4.25637 -0.70557 -2.58920 3.04279 0.45358
magnitude: 0.95890 au
magnitude: 2.43732 debye
