program: Orca
programVersion: 5.0.2
elementType: Cl O O O N C C C C C C C C C C C C C C C C C C C C C C C C C H H H H H H H H H H H H H H H H H H H H H H
charge: 0
multiplicity: 1
keywords: wb97x-d3
keywords: def2-TZVPP
keywords: def2/J RIJCOSX
keywords: DEFGRID2
keywords: scfconv7
keywords: smallprint printgap noloewdin
keywords: NOSOSCF
formula: C25H22ClNO3
InChI: InChI=1/C25H22ClNO3/c1-17(2)24(18-11-13-20(26)14-12-18)25(28)30-23(16-27)19-7-6-10-22(15-19)29-21-8-4-3-5-9-21/h3-15,17,23-24H,1-2H3
52 atoms
Cl -3.088556 -2.533321 -0.550549
O  2.722311 0.715884 0.517132
O  3.491026 -0.202695 -1.382409
O  -1.99361 1.383535 -1.184264
N  4.384553 3.536824 1.154447
C  2.785262 -1.625568 0.439603
C  3.704167 -2.767603 -0.016423
C  1.310053 -1.876621 0.193013
C  5.162122 -2.45364 0.305782
C  3.287418 -4.076304 0.645397
C  3.079875 -0.319111 -0.263899
C  0.837109 -2.146248 -1.088802
C  0.393062 -1.799954 1.233322
C  2.651579 2.011695 -0.067708
C  -0.512933 -2.346816 -1.32332
C  -0.961067 -1.999607 1.014154
C  1.228006 2.511023 0.029822
C  -1.408548 -2.275112 -0.267255
C  0.240133 1.738548 -0.573412
C  0.885325 3.681114 0.687827
C  -1.080814 2.143917 -0.521564
C  3.61782 2.864977 0.625524
C  -0.445236 4.078755 0.731193
C  -1.433882 3.32101 0.131787
C  -3.153438 1.009365 -0.570782
C  -3.246151 0.794427 0.79831
C  -4.249458 0.791005 -1.39334
C  -4.447716 0.356543 1.334512
C  -5.439604 0.344993 -0.84366
C  -5.547221 0.127182 0.522152
H  2.927322 -1.476279 1.514918
H  3.609442 -2.879503 -1.100305
H  5.52174 -1.56345 -0.208874
H  5.303221 -2.305063 1.378893
H  5.806566 -3.280372 0.005967
H  3.350247 -4.00357 1.733788
H  3.946687 -4.887157 0.334846
H  2.267896 -4.363758 0.390477
H  1.524821 -2.194135 -1.924061
H  0.737371 -1.578714 2.235847
H  2.955164 1.962623 -1.118765
H  -0.868438 -2.554928 -2.32286
H  -1.664623 -1.940062 1.832892
H  0.47725 0.81802 -1.093624
H  1.640999 4.289779 1.166388
H  -0.711493 4.995912 1.238979
H  -2.467521 3.640307 0.16485
H  -2.390872 0.954705 1.441747
H  -4.158069 0.960322 -2.458135
H  -4.51875 0.186805 2.400939
H  -6.289873 0.1709 -1.489776
H  -6.478482 -0.219708 0.948599
totalener: -1706.63019659 hartree
nucrepener: 3052.46354883 hartree
electener: -4759.09374542 hartree
oneelecener: -8399.19132220 hartree
twoeener: 3640.09757678 hartree
kineticenergy: 1700.60980262 hartree
xcener: -142.771402967797 hartree
chargesum: 0.0000000
charge: -0.070767 -0.255632 -0.345508 -0.295270 0.000228 0.094192 0.048234 -0.044966 -0.275960 -0.278395 0.289950 -0.201300 -0.113569 0.350936 -0.119883 -0.175314 -0.033660 0.128794 -0.184766 -0.139522 0.171634 -0.286039 -0.099421 -0.141330 0.288383 -0.207786 -0.227867 -0.104014 -0.081848 -0.146860 0.085754 0.047765 0.103897 0.082446 0.084437 0.078733 0.090732 0.100212 0.130758 0.107366 0.138549 0.121942 0.121852 0.142700 0.128880 0.132341 0.136229 0.127588 0.122010 0.124499 0.124482 0.124151
qa: -0.0708 -0.2556 -0.3455 -0.2953 0.0002 0.0942 0.0482 -0.0450 -0.2760 -0.2784 0.2900 -0.2013 -0.1136 0.3509 -0.1199 -0.1753 -0.0337 0.1288 -0.1848 -0.1395 0.1716 -0.2860 -0.0994 -0.1413 0.2884 -0.2078 -0.2279 -0.1040 -0.0818 -0.1469 0.0858 0.0478 0.1039 0.0824 0.0844 0.0787 0.0907 0.1002 0.1308 0.1074 0.1385 0.1219 0.1219 0.1427 0.1289 0.1323 0.1362 0.1276 0.1220 0.1245 0.1245 0.1242
va: 1.2390 2.1321 2.1504 2.0782 3.1188 3.7180 3.8290 3.5209 3.9323 3.9442 4.2787 3.9834 3.9936 3.7644 4.0448 4.0030 3.8767 3.8825 3.9931 3.9530 3.9174 4.0580 3.9635 3.9616 3.6572 3.8911 4.0519 3.9465 3.9225 3.9680 1.0373 1.0255 1.0141 1.0041 1.0068 1.0052 1.0078 1.0038 1.0202 1.0125 1.0242 1.0137 1.0116 1.0027 1.0229 1.0010 1.0029 1.0090 1.0160 0.9998 0.9987 1.0004
dispcorr: -0.033414909 hartree
energy: -1706.663611502599
dipole: 14.23711 -15.33923 -1.10212 -10.86467 10.12487 -0.73980 5.92839 -5.65168 0.27671
magnitude: 1.35593 au
magnitude: 3.44650 debye
