program: Orca
programVersion: 5.0.2
elementType: Cl O O O N C C C C C C C C C C C C C C C C C C C C C C C C C H H H H H H H H H H H H H H H H H H H H H H
charge: 0
multiplicity: 1
keywords: wb97x-d3
keywords: def2-TZVPP
keywords: def2/J RIJCOSX
keywords: DEFGRID2
keywords: scfconv7
keywords: smallprint printgap noloewdin
keywords: NOSOSCF
formula: C25H22ClNO3
InChI: InChI=1/C25H22ClNO3/c1-17(2)24(18-11-13-20(26)14-12-18)25(28)30-23(16-27)19-7-6-10-22(15-19)29-21-8-4-3-5-9-21/h3-15,17,23-24H,1-2H3
52 atoms
Cl -0.666514 -2.987232 3.836965
O  2.508732 0.88284 -0.363637
O  1.48603 0.011417 -2.153705
O  -3.185764 0.755327 -0.384236
N  2.735877 3.922355 0.930096
C  2.877657 -1.402517 -0.76856
C  3.036477 -2.428193 -1.898191
C  2.004124 -1.867601 0.381314
C  3.985662 -1.906373 -2.973211
C  3.542988 -3.755745 -1.34543
C  2.229319 -0.113094 -1.223322
C  0.663285 -2.178157 0.172443
C  2.506213 -1.933149 1.674338
C  1.569151 1.954606 -0.329158
C  -0.157377 -2.539621 1.226496
C  1.698092 -2.296152 2.740662
C  0.311079 1.503851 0.373433
C  0.365911 -2.5902 2.50797
C  -0.869902 1.403093 -0.343379
C  0.366719 1.102267 1.703582
C  -2.01097 0.913975 0.283113
C  2.233572 3.047114 0.38193
C  -0.770617 0.600203 2.309391
C  -1.963382 0.508611 1.607702
C  -3.575831 1.701445 -1.291055
C  -4.068398 1.26152 -2.509583
C  -3.532768 3.057687 -0.992933
C  -4.52679 2.187587 -3.434618
C  -3.985655 3.972295 -1.930282
C  -4.483167 3.544081 -3.152651
H  3.869328 -1.168507 -0.366031
H  2.056527 -2.594655 -2.354834
H  3.626824 -0.988004 -3.435187
H  4.977317 -1.712725 -2.5581
H  4.105449 -2.641892 -3.768947
H  3.657054 -4.483569 -2.148841
H  2.864496 -4.182896 -0.607692
H  4.519451 -3.638571 -0.869852
H  0.237125 -2.116134 -0.820844
H  3.544684 -1.688849 1.859841
H  1.336456 2.304411 -1.339739
H  -1.201626 -2.758908 1.055089
H  2.099746 -2.339348 3.743541
H  -0.899129 1.686803 -1.388027
H  1.292594 1.169901 2.25974
H  -0.733379 0.273098 3.339576
H  -2.856012 0.119459 2.079645
H  -4.09437 0.201488 -2.723589
H  -3.155774 3.396989 -0.036668
H  -4.913206 1.843855 -4.384678
H  -3.954474 5.028364 -1.698354
H  -4.836888 4.263299 -3.878527
totalener: -1706.62949443 hartree
nucrepener: 3017.33786473 hartree
electener: -4723.96735916 hartree
oneelecener: -8328.87517543 hartree
twoeener: 3604.90781627 hartree
kineticenergy: 1700.62835353 hartree
xcener: -142.773364271384 hartree
chargesum: 0.0000000
charge: -0.078988 -0.257734 -0.341555 -0.300166 0.000070 0.066124 0.059274 -0.022217 -0.276666 -0.280014 0.289552 -0.151873 -0.143472 0.319955 -0.151740 -0.134275 0.038154 0.097960 -0.112009 -0.209823 0.212630 -0.268024 -0.075964 -0.217421 0.220560 -0.199551 -0.145520 -0.094380 -0.119619 -0.138200 0.087999 0.045007 0.102719 0.080479 0.084998 0.091583 0.100259 0.078088 0.127898 0.108925 0.119586 0.123339 0.120630 0.122596 0.118583 0.131163 0.130249 0.125010 0.133584 0.125822 0.129649 0.126765
qa: -0.0790 -0.2577 -0.3416 -0.3002 0.0001 0.0661 0.0593 -0.0222 -0.2767 -0.2800 0.2896 -0.1519 -0.1435 0.3200 -0.1517 -0.1343 0.0382 0.0980 -0.1120 -0.2098 0.2126 -0.2680 -0.0760 -0.2174 0.2206 -0.1996 -0.1455 -0.0944 -0.1196 -0.1382 0.0880 0.0450 0.1027 0.0805 0.0850 0.0916 0.1003 0.0781 0.1279 0.1089 0.1196 0.1233 0.1206 0.1226 0.1186 0.1312 0.1302 0.1250 0.1336 0.1258 0.1296 0.1268
va: 1.2288 2.1517 2.1497 2.1025 3.1205 3.7535 3.8223 3.5345 3.9316 3.9450 4.2981 3.9554 3.9975 3.8374 3.9875 4.0164 3.6071 3.8689 3.8975 4.0092 3.8531 4.0380 3.8662 4.0076 3.8252 4.0394 3.9389 3.9384 3.9504 3.9569 1.0359 1.0262 1.0145 1.0040 1.0072 1.0076 1.0040 1.0049 1.0184 1.0114 1.0193 1.0129 1.0137 1.0211 1.0191 1.0018 1.0132 1.0139 1.0043 0.9990 0.9996 1.0002
dispcorr: -0.032932638 hartree
energy: -1706.662427066378
dipole: 11.35465 -11.58159 -0.22694 -5.82704 4.91608 -0.91096 -22.22611 21.61020 -0.61591
magnitude: 1.12281 au
magnitude: 2.85395 debye
