program: Orca
programVersion: 5.0.2
elementType: Cl O O O N C C C C C C C C C C C C C C C C C C C C C C C C C H H H H H H H H H H H H H H H H H H H H H H
charge: 0
multiplicity: 1
keywords: wb97x-d3
keywords: def2-TZVPP
keywords: def2/J RIJCOSX
keywords: DEFGRID2
keywords: scfconv7
keywords: smallprint printgap noloewdin
keywords: NOSOSCF
formula: C25H22ClNO3
InChI: InChI=1/C25H22ClNO3/c1-17(2)24(18-11-13-20(26)14-12-18)25(28)30-23(16-27)19-7-6-10-22(15-19)29-21-8-4-3-5-9-21/h3-15,17,23-24H,1-2H3
52 atoms
Cl -2.766374 -2.204345 -1.984783
O  2.373242 0.651112 1.11081
O  3.72065 0.203548 -0.620329
O  -2.466542 1.049722 -0.727122
N  1.509905 3.44195 2.688914
C  2.658231 -1.613958 0.573678
C  3.703105 -2.628611 0.092175
C  1.294071 -1.781165 -0.069531
C  5.030136 -2.430952 0.817769
C  3.190885 -4.04953 0.303607
C  3.028869 -0.178986 0.278872
C  1.131495 -1.607674 -1.441028
C  0.173896 -2.066971 0.699544
C  2.164479 1.974087 0.630013
C  -0.114046 -1.730447 -2.032352
C  -1.078919 -2.201352 0.121361
C  1.064376 1.976132 -0.404174
C  -1.213709 -2.033207 -1.245906
C  -0.196807 1.516078 -0.041944
C  1.32636 2.37745 -1.703418
C  -1.211848 1.49473 -0.985835
C  1.801006 2.779296 1.797137
C  0.307161 2.333036 -2.644989
C  -0.957724 1.901273 -2.292615
C  -3.014919 1.134276 0.521489
C  -3.820782 0.078594 0.923901
C  -2.848922 2.245211 1.339476
C  -4.450011 0.130465 2.157941
C  -3.474624 2.276965 2.576241
C  -4.273807 1.223252 2.993385
H  2.537831 -1.724922 1.656701
H  3.868907 -2.474228 -0.978079
H  5.762125 -3.167135 0.484364
H  5.459725 -1.446081 0.639255
H  4.909913 -2.559069 1.896159
H  2.971176 -4.236139 1.357473
H  3.941936 -4.77648 -0.006318
H  2.283179 -4.249779 -0.264507
H  1.981028 -1.358669 -2.064207
H  0.274326 -2.189747 1.770757
H  3.084326 2.388604 0.206086
H  -0.229531 -1.584646 -3.097111
H  -1.940061 -2.428363 0.733938
H  -0.382547 1.180544 0.970716
H  2.316079 2.713793 -1.98254
H  0.50021 2.643392 -3.66299
H  -1.758138 1.873723 -3.020204
H  -3.960006 -0.765925 0.261947
H  -2.238367 3.080847 1.02319
H  -5.081223 -0.692336 2.466842
H  -3.336301 3.139606 3.21409
H  -4.760096 1.257079 3.95869
totalener: -1706.63003052 hartree
nucrepener: 3119.89335403 hartree
electener: -4826.52338455 hartree
oneelecener: -8534.20051209 hartree
twoeener: 3707.67712754 hartree
kineticenergy: 1700.61967187 hartree
xcener: -142.774120655768 hartree
chargesum: 0.0000000
charge: -0.076754 -0.266076 -0.339035 -0.289240 -0.002006 0.065183 0.060351 -0.009004 -0.275785 -0.279881 0.283682 -0.161351 -0.156567 0.338731 -0.150940 -0.140709 0.041456 0.128083 -0.242028 -0.139064 0.276182 -0.271395 -0.073355 -0.238864 0.319408 -0.271077 -0.204085 -0.088481 -0.104244 -0.151834 0.086465 0.044572 0.084305 0.102777 0.080699 0.078114 0.090819 0.100173 0.125825 0.109509 0.122287 0.118990 0.117008 0.131644 0.112760 0.129002 0.127734 0.134519 0.137377 0.127248 0.131378 0.125493
qa: -0.0768 -0.2661 -0.3390 -0.2892 -0.0020 0.0652 0.0604 -0.0090 -0.2758 -0.2799 0.2837 -0.1614 -0.1566 0.3387 -0.1509 -0.1407 0.0415 0.1281 -0.2420 -0.1391 0.2762 -0.2714 -0.0734 -0.2389 0.3194 -0.2711 -0.2041 -0.0885 -0.1042 -0.1518 0.0865 0.0446 0.0843 0.1028 0.0807 0.0781 0.0908 0.1002 0.1258 0.1095 0.1223 0.1190 0.1170 0.1316 0.1128 0.1290 0.1277 0.1345 0.1374 0.1272 0.1314 0.1255
va: 1.2341 2.1453 2.1540 2.0974 3.1188 3.7532 3.8166 3.5230 3.9299 3.9478 4.3151 3.9700 3.9934 3.8330 4.0203 3.9735 3.6454 3.8206 3.9699 3.9928 3.7006 4.0426 3.9263 4.0449 3.7316 4.0032 3.9664 3.9614 3.9444 3.9810 1.0378 1.0264 1.0075 1.0142 1.0038 1.0048 1.0078 1.0039 1.0216 1.0116 1.0193 1.0149 1.0132 1.0184 1.0157 0.9983 1.0142 1.0322 1.0040 1.0000 0.9989 1.0003
dispcorr: -0.035527745 hartree
energy: -1706.665558264559
dipole: 18.97497 -18.79175 0.18322 -11.34849 10.48177 -0.86672 7.67761 -8.14536 -0.46775
magnitude: 1.00178 au
magnitude: 2.54632 debye
