program: Orca
programVersion: 5.0.2
elementType: Cl O O O N C C C C C C C C C C C C C C C C C C C C C C C C C H H H H H H H H H H H H H H H H H H H H H H
charge: 0
multiplicity: 1
keywords: wb97x-d3
keywords: def2-TZVPP
keywords: def2/J RIJCOSX
keywords: DEFGRID2
keywords: scfconv7
keywords: smallprint printgap noloewdin
keywords: NOSOSCF
formula: C25H22ClNO3
InChI: InChI=1/C25H22ClNO3/c1-17(2)24(18-11-13-20(26)14-12-18)25(28)30-23(16-27)19-7-6-10-22(15-19)29-21-8-4-3-5-9-21/h3-15,17,23-24H,1-2H3
52 atoms
Cl -2.65887 -3.062192 0.178944
O  2.88402 0.744329 0.754468
O  3.478573 0.242177 -1.342283
O  -2.155907 0.757567 0.342284
N  2.473619 3.541636 2.47984
C  3.169279 -1.536057 0.27069
C  4.05776 -2.491294 -0.539497
C  1.698583 -1.904225 0.248437
C  5.52939 -2.109653 -0.40665
C  3.843388 -3.931274 -0.084245
C  3.233747 -0.108927 -0.224122
C  1.040348 -2.268027 1.416219
C  0.974493 -1.873071 -0.94002
C  2.512694 2.050528 0.334897
C  -0.30155 -2.615049 1.40609
C  -0.366972 -2.21506 -0.966548
C  1.1593 2.037591 -0.335378
C  -0.995765 -2.591439 0.208926
C  0.087681 1.431176 0.307345
C  0.995469 2.613389 -1.58486
C  -1.153267 1.403948 -0.308152
C  2.496461 2.870387 1.548048
C  -0.253087 2.586972 -2.188176
C  -1.329497 1.984218 -1.561002
C  -3.428795 1.254617 0.273454
C  -4.4582 0.361187 0.021812
C  -3.696089 2.599268 0.499144
C  -5.766636 0.820287 -0.002273
C  -5.007709 3.04497 0.463973
C  -6.047542 2.161122 0.212267
H  3.503838 -1.552341 1.313639
H  3.774653 -2.414594 -1.5935
H  5.737743 -1.110302 -0.786164
H  5.851613 -2.1505 0.636542
H  6.156449 -2.803949 -0.966792
H  4.081426 -4.050352 0.975555
H  4.493478 -4.606548 -0.641209
H  2.81699 -4.264841 -0.23302
H  1.581878 -2.288011 2.353845
H  1.453565 -1.571215 -1.863086
H  3.260911 2.470491 -0.345146
H  -0.800284 -2.902288 2.32116
H  -0.919183 -2.185906 -1.895389
H  0.203704 0.971275 1.281124
H  1.836678 3.068861 -2.090664
H  -0.387411 3.028873 -3.166249
H  -2.297448 1.961021 -2.044592
H  -4.228515 -0.68294 -0.142847
H  -2.889961 3.291176 0.707991
H  -6.570119 0.122126 -0.196527
H  -5.216646 4.091284 0.643405
H  -7.069336 2.514744 0.189231
totalener: -1706.63104024 hartree
nucrepener: 3027.77087439 hartree
electener: -4734.40191463 hartree
oneelecener: -8349.98869194 hartree
twoeener: 3615.58677731 hartree
kineticenergy: 1700.60976507 hartree
xcener: -142.767840233852 hartree
chargesum: -0.0000000
charge: -0.089459 -0.261877 -0.338542 -0.292345 0.001016 0.073339 0.061209 -0.036729 -0.275569 -0.281933 0.274416 -0.161564 -0.119985 0.322443 -0.124453 -0.185147 0.083866 0.145205 -0.239733 -0.129102 0.180674 -0.265171 -0.103035 -0.153131 0.208749 -0.183890 -0.134541 -0.121361 -0.128919 -0.127879 0.086054 0.045291 0.101673 0.080761 0.084494 0.077895 0.091382 0.100608 0.108836 0.128765 0.122833 0.122122 0.117265 0.123058 0.108308 0.129454 0.136990 0.124262 0.134356 0.125965 0.127418 0.125656
qa: -0.0895 -0.2619 -0.3385 -0.2923 0.0010 0.0733 0.0612 -0.0367 -0.2756 -0.2819 0.2744 -0.1616 -0.1200 0.3224 -0.1245 -0.1851 0.0839 0.1452 -0.2397 -0.1291 0.1807 -0.2652 -0.1030 -0.1531 0.2087 -0.1839 -0.1345 -0.1214 -0.1289 -0.1279 0.0861 0.0453 0.1017 0.0808 0.0845 0.0779 0.0914 0.1006 0.1088 0.1288 0.1228 0.1221 0.1173 0.1231 0.1083 0.1295 0.1370 0.1243 0.1344 0.1260 0.1274 0.1257
va: 1.2151 2.1441 2.1545 2.0683 3.1207 3.7676 3.8141 3.5268 3.9311 3.9495 4.2989 4.0038 3.9230 3.8306 4.0588 4.0539 3.5847 3.8353 4.0447 4.0063 3.8195 4.0387 3.9678 3.9677 3.8288 3.9907 3.9426 3.9858 3.9584 3.9442 1.0371 1.0269 1.0147 1.0039 1.0076 1.0049 1.0078 1.0034 1.0122 1.0187 1.0168 1.0126 1.0161 1.0272 1.0143 1.0006 1.0034 1.0403 1.0032 1.0002 1.0000 0.9999
dispcorr: -0.032338494 hartree
energy: -1706.663378735979
dipole: 17.21867 -17.39280 -0.17413 -6.25868 5.58138 -0.67730 -5.81663 4.85098 -0.96565
magnitude: 1.19228 au
magnitude: 3.03054 debye
