program: Orca
programVersion: 5.0.2
elementType: Cl O O O N C C C C C C C C C C C C C C C C C C C C C C C C C H H H H H H H H H H H H H H H H H H H H H H
charge: 0
multiplicity: 1
keywords: wb97x-d3
keywords: def2-TZVPP
keywords: def2/J RIJCOSX
keywords: DEFGRID2
keywords: scfconv7
keywords: smallprint printgap noloewdin
keywords: NOSOSCF
formula: C25H22ClNO3
InChI: InChI=1/C25H22ClNO3/c1-17(2)24(18-11-13-20(26)14-12-18)25(28)30-23(16-27)19-7-6-10-22(15-19)29-21-8-4-3-5-9-21/h3-15,17,23-24H,1-2H3
52 atoms
Cl -2.666981 -2.873682 0.853824
O  2.924652 0.697375 0.678333
O  3.336483 0.26572 -1.477222
O  -2.099911 0.771403 0.234053
N  2.606178 3.382521 2.579349
C  3.164027 -1.564051 0.1053
C  3.904845 -2.514022 -0.846748
C  1.69954 -1.905442 0.290843
C  5.389729 -2.170792 -0.918951
C  3.720772 -3.960793 -0.399121
C  3.187534 -0.122694 -0.354764
C  0.813134 -1.835405 -0.78004
C  1.20676 -2.267321 1.537497
C  2.574152 2.031691 0.342562
C  -0.529583 -2.128149 -0.613877
C  -0.134486 -2.566924 1.71944
C  1.212526 2.1060 -0.30873
C  -0.995308 -2.496685 0.637722
C  0.142533 1.430208 0.260596
C  1.042474 2.846517 -1.468587
C  -1.105179 1.493147 -0.343472
C  2.595113 2.773189 1.605761
C  -0.209945 2.908834 -2.057859
C  -1.286695 2.233511 -1.507621
C  -3.400093 1.167516 0.068836
C  -4.303079 0.25533 -0.452639
C  -3.815371 2.434887 0.457169
C  -5.636318 0.616227 -0.582704
C  -5.148239 2.785385 0.314316
C  -6.06289 1.880252 -0.206185
H  3.647853 -1.612879 1.087255
H  3.476618 -2.402954 -1.847299
H  5.568412 -1.166805 -1.300487
H  5.85819 -2.249105 0.065153
H  5.90956 -2.864542 -1.580483
H  4.265033 -4.635492 -1.060397
H  2.675156 -4.266108 -0.403756
H  4.106491 -4.113746 0.611778
H  1.163696 -1.533635 -1.75926
H  1.876712 -2.31671 2.386841
H  3.323477 2.476386 -0.321073
H  -1.209335 -2.061046 -1.451652
H  -0.505604 -2.84859 2.695027
H  0.262113 0.844915 1.164444
H  1.882985 3.358951 -1.917978
H  -0.34965 3.477123 -2.967749
H  -2.255787 2.278985 -1.986488
H  -3.964373 -0.732066 -0.735276
H  -3.104276 3.137786 0.872435
H  -6.342926 -0.097478 -0.984854
H  -5.473712 3.771013 0.619726
H  -7.102795 2.158042 -0.311848
totalener: -1706.63034319 hartree
nucrepener: 3033.99673633 hartree
electener: -4740.62707952 hartree
oneelecener: -8362.49193902 hartree
twoeener: 3621.86485950 hartree
kineticenergy: 1700.61106255 hartree
xcener: -142.768980785170 hartree
chargesum: -0.0000000
charge: -0.081641 -0.259428 -0.333856 -0.284744 0.000543 0.064252 0.064861 -0.062190 -0.277045 -0.281544 0.270736 -0.092368 -0.146625 0.309406 -0.199296 -0.139211 0.091799 0.150367 -0.257388 -0.131904 0.200618 -0.262216 -0.110061 -0.160273 0.235253 -0.178324 -0.155086 -0.118073 -0.116751 -0.131177 0.086497 0.043865 0.102748 0.079930 0.084488 0.091350 0.100377 0.078329 0.129149 0.107983 0.123558 0.117856 0.122137 0.131410 0.105100 0.128469 0.135215 0.105390 0.135848 0.127031 0.127972 0.126663
qa: -0.0816 -0.2594 -0.3339 -0.2847 0.0005 0.0643 0.0649 -0.0622 -0.2770 -0.2815 0.2707 -0.0924 -0.1466 0.3094 -0.1993 -0.1392 0.0918 0.1504 -0.2574 -0.1319 0.2006 -0.2622 -0.1101 -0.1603 0.2353 -0.1783 -0.1551 -0.1181 -0.1168 -0.1312 0.0865 0.0439 0.1027 0.0799 0.0845 0.0914 0.1004 0.0783 0.1291 0.1080 0.1236 0.1179 0.1221 0.1314 0.1051 0.1285 0.1352 0.1054 0.1358 0.1270 0.1280 0.1267
va: 1.2271 2.1403 2.1600 2.0875 3.1211 3.7712 3.8173 3.5368 3.9306 3.9483 4.2927 3.9100 4.0059 3.8376 4.0358 4.0669 3.5981 3.8540 4.0545 4.0095 3.8330 4.0349 3.9816 3.9597 3.7905 4.0046 3.9783 3.9824 3.9474 3.9531 1.0359 1.0265 1.0151 1.0036 1.0075 1.0078 1.0036 1.0048 1.0182 1.0130 1.0152 1.0116 1.0126 1.0173 1.0137 1.0010 1.0054 1.0383 1.0030 1.0003 0.9995 0.9998
dispcorr: -0.032697129 hartree
energy: -1706.663040321822
dipole: 16.57880 -16.85267 -0.27387 -6.92842 6.31790 -0.61052 -9.98343 8.91998 -1.06345
magnitude: 1.25645 au
magnitude: 3.19365 debye
