program: Orca
programVersion: 5.0.2
elementType: O O O N C C C C C C C C C C C C C C C C C C C C C C H H H H H H H H H H H H H H H H H H H H H H H
charge: 0
multiplicity: 1
keywords: wb97x-d3
keywords: def2-TZVPP
keywords: def2/J RIJCOSX
keywords: DEFGRID2
keywords: scfconv7
keywords: smallprint printgap noloewdin
keywords: NOSOSCF
formula: C22H23NO3
InChI: InChI=1/C22H23NO3/c1-21(2)19(22(21,3)4)20(24)26-18(14-23)15-9-8-12-17(13-15)25-16-10-6-5-7-11-16/h5-13,18-19H,1-4H3
49 atoms
O  0.266238 1.856533 0.868012
O  0.550836 3.193926 -0.900747
O  -2.363144 -2.383996 -0.962766
N  -2.065356 1.540939 3.184153
C  3.033825 0.772336 0.023539
C  3.354595 1.804348 -1.037992
C  2.459349 2.164857 0.117534
C  2.129118 -0.392353 -0.30969
C  4.08691 0.379938 1.034452
C  4.725258 2.441735 -1.075742
C  2.786738 1.643618 -2.431221
C  1.019332 2.464018 -0.06458
C  -1.144523 2.059952 0.794697
C  -1.783157 1.170298 -0.244386
C  -1.645295 1.760831 2.136697
C  -1.76022 -0.211656 -0.073212
C  -2.350066 1.737103 -1.374406
C  -2.309215 -1.023923 -1.054276
C  -2.898815 0.909502 -2.34595
C  -2.876993 -0.464686 -2.195719
C  -1.596236 -3.031022 -0.016913
C  -2.2388 -3.672535 1.028886
C  -0.215756 -3.074529 -0.14704
C  -1.48258 -4.375595 1.957859
C  0.529453 -3.767895 0.795266
C  -0.099816 -4.41962 1.848408
H  2.89369 2.806363 0.882654
H  2.709098 -1.198996 -0.763103
H  1.676256 -0.790927 0.599936
H  1.318248 -0.15235 -0.995812
H  4.681391 1.22137 1.385665
H  3.619368 -0.072016 1.91159
H  4.771503 -0.359125 0.612875
H  5.123922 2.664391 -0.087605
H  5.441302 1.795197 -1.587332
H  4.685649 3.384126 -1.625894
H  1.79341 1.202333 -2.466438
H  2.732012 2.609267 -2.936855
H  3.444949 1.004921 -3.023645
H  -1.382239 3.108212 0.5902
H  -1.324576 -0.641229 0.821128
H  -2.365911 2.811698 -1.49834
H  -3.341663 1.340207 -3.233738
H  -3.302496 -1.108606 -2.954951
H  -3.317149 -3.628573 1.112455
H  0.271504 -2.576179 -0.975535
H  -1.979664 -4.883263 2.773634
H  1.60685 -3.800264 0.700807
H  0.485554 -4.962377 2.578472
elementType: O N C H
totalener: -1132.68175335 hartree
nucrepener: 2321.75246361 hartree
electener: -3454.43421696 hartree
oneelecener: -6152.27879238 hartree
twoeener: 2697.84457542 hartree
cpcmener: -0.03401975 hartree
kineticenergy: 1127.65701463 hartree
xcener: -110.658183367175 hartree
chargesum: 0.0000000
charge: -0.275355 -0.452406 -0.337859 -0.101162 0.143213 0.096490 -0.130875 -0.344121 -0.287301 -0.293663 -0.304574 0.380944 0.407171 0.040197 -0.229344 -0.274321 -0.214423 0.316311 -0.102244 -0.251367 0.260339 -0.200077 -0.207021 -0.149082 -0.160168 -0.160001 0.107731 0.114371 0.098735 0.087062 0.093560 0.094608 0.097458 0.091598 0.097630 0.094727 0.092149 0.099400 0.099257 0.144274 0.143918 0.147688 0.161479 0.149879 0.150449 0.174884 0.161482 0.165671 0.162683
qa: -0.2754 -0.4524 -0.3379 -0.1012 0.1432 0.0965 -0.1309 -0.3441 -0.2873 -0.2937 -0.3046 0.3809 0.4072 0.0402 -0.2293 -0.2743 -0.2144 0.3163 -0.1022 -0.2514 0.2603 -0.2001 -0.2070 -0.1491 -0.1602 -0.1600 0.1077 0.1144 0.0987 0.0871 0.0936 0.0946 0.0975 0.0916 0.0976 0.0947 0.0921 0.0994 0.0993 0.1443 0.1439 0.1477 0.1615 0.1499 0.1504 0.1749 0.1615 0.1657 0.1627
va: 2.1338 2.0427 2.0761 3.1107 3.6940 3.7294 3.9184 3.9259 3.8913 3.8969 3.9132 4.1436 3.7322 3.5816 4.0854 3.9430 3.9687 3.7136 3.8981 4.0173 3.6909 3.9911 3.9384 3.8855 3.8787 3.8879 1.0156 0.9972 0.9971 0.9933 1.0047 1.0024 0.9991 1.0048 0.9990 1.0023 1.0016 1.0046 1.0006 1.0139 1.0130 1.0091 0.9878 1.0061 1.0031 0.9818 0.9884 0.9882 0.9885
dispcorr: -0.027765367 hartree
energy: -1132.709518719347
dipole: 28.49102 -27.08698 1.40404 -0.31604 -0.19913 -0.51516 -6.97770 6.11937 -0.85834
magnitude: 1.72438 au
magnitude: 4.38302 debye
