program: Orca
programVersion: 5.0.2
elementType: O O O N C C C C C C C C C C C C C C C C C C C C C C H H H H H H H H H H H H H H H H H H H H H H H
charge: 0
multiplicity: 1
keywords: wb97x-d3
keywords: def2-TZVPP
keywords: def2/J RIJCOSX
keywords: DEFGRID2
keywords: scfconv7
keywords: smallprint printgap noloewdin
keywords: NOSOSCF
formula: C22H23NO3
InChI: InChI=1/C22H23NO3/c1-21(2)19(22(21,3)4)20(24)26-18(14-23)15-9-8-12-17(13-15)25-16-10-6-5-7-11-16/h5-13,18-19H,1-4H3
49 atoms
O  0.745094 1.417961 0.584525
O  0.777899 2.737043 -1.216635
O  -2.133198 -2.843118 -0.666591
N  -1.250688 1.207621 3.203404
C  3.672013 1.651934 -1.683942
C  3.894785 2.745421 -0.69145
C  2.804747 1.702194 -0.427116
C  3.089619 1.941505 -3.048315
C  4.642026 0.49249 -1.753059
C  5.085692 2.686665 0.23988
C  3.530616 4.175941 -1.010817
C  1.377369 2.030759 -0.443005
C  -0.65581 1.640992 0.695365
C  -1.449104 0.726181 -0.206213
C  -0.97389 1.393567 2.102606
C  -1.408923 -0.646505 0.00691
C  -2.18918 1.256641 -1.253719
C  -2.141883 -1.482665 -0.821669
C  -2.896528 0.404236 -2.08932
C  -2.882536 -0.964627 -1.87547
C  -2.198893 -3.379912 0.597305
C  -3.007012 -2.836576 1.588632
C  -1.461916 -4.530949 0.83375
C  -3.05904 -3.451818 2.830927
C  -1.534694 -5.142468 2.077564
C  -2.324554 -4.60302 3.083255
H  3.064733 0.971843 0.330657
H  3.906312 2.07819 -3.759718
H  2.49721 1.093707 -3.396678
H  2.463612 2.825877 -3.103806
H  4.176063 -0.35681 -2.255746
H  5.526246 0.77043 -2.330083
H  4.976295 0.145866 -0.777303
H  4.913877 3.321148 1.111084
H  5.300256 1.685307 0.607017
H  5.980869 3.056392 -0.264443
H  4.395926 4.677261 -1.448696
H  2.703951 4.295123 -1.703826
H  3.273886 4.713322 -0.096156
H  -0.909789 2.685068 0.488411
H  -0.822105 -1.0599 0.819382
H  -2.217506 2.326226 -1.414376
H  -3.473483 0.809491 -2.909389
H  -3.445057 -1.62944 -2.518302
H  -3.593785 -1.946155 1.402127
H  -0.840941 -4.945708 0.050075
H  -3.685525 -3.026818 3.604008
H  -0.961202 -6.041614 2.260132
H  -2.371084 -5.077414 4.054186
elementType: O N C H
totalener: -1132.68439658 hartree
nucrepener: 2223.97687740 hartree
electener: -3356.66127398 hartree
oneelecener: -5957.27287966 hartree
twoeener: 2600.61160569 hartree
cpcmener: -0.03218463 hartree
kineticenergy: 1127.65674799 hartree
xcener: -110.659705400207 hartree
chargesum: 0.0000000
charge: -0.297029 -0.484348 -0.340902 -0.105439 0.100601 0.100708 -0.114448 -0.303186 -0.284042 -0.283294 -0.301658 0.403049 0.437839 0.015609 -0.224493 -0.192982 -0.190505 0.227644 -0.126887 -0.223396 0.282330 -0.184881 -0.250583 -0.151276 -0.126064 -0.188467 0.087541 0.098448 0.102265 0.097259 0.095419 0.099511 0.092681 0.095232 0.092532 0.100584 0.100444 0.096595 0.102280 0.139917 0.148821 0.149510 0.162858 0.151317 0.157272 0.149473 0.163308 0.161509 0.161325
qa: -0.2970 -0.4843 -0.3409 -0.1054 0.1006 0.1007 -0.1144 -0.3032 -0.2840 -0.2833 -0.3017 0.4030 0.4378 0.0156 -0.2245 -0.1930 -0.1905 0.2276 -0.1269 -0.2234 0.2823 -0.1849 -0.2506 -0.1513 -0.1261 -0.1885 0.0875 0.0984 0.1023 0.0973 0.0954 0.0995 0.0927 0.0952 0.0925 0.1006 0.1004 0.0966 0.1023 0.1399 0.1488 0.1495 0.1629 0.1513 0.1573 0.1495 0.1633 0.1615 0.1613
va: 2.1254 2.0178 2.0646 3.1073 3.6917 3.7044 3.9199 3.9069 3.9099 3.9073 3.9119 4.0893 3.7114 3.5774 4.0740 3.9668 3.9441 3.7686 3.9063 4.0107 3.6832 3.8859 4.0034 3.8890 3.8809 3.8992 1.0323 0.9984 0.9990 1.0115 1.0023 0.9985 1.0054 1.0026 1.0055 0.9986 0.9981 1.0126 0.9989 1.0173 1.0102 1.0080 0.9883 1.0031 0.9969 1.0069 0.9890 0.9878 0.9893
dispcorr: -0.023758863 hartree
energy: -1132.708155441083
dipole: 28.76308 -27.67010 1.09297 10.75384 -10.72961 0.02422 -10.41890 9.36397 -1.05492
magnitude: 1.51922 au
magnitude: 3.86155 debye
