program: Orca
programVersion: 5.0.2
elementType: O O O N C C C C C C C C C C C C C C C C C C C C C C H H H H H H H H H H H H H H H H H H H H H H H
charge: 0
multiplicity: 1
keywords: wb97x-d3
keywords: def2-TZVPP
keywords: def2/J RIJCOSX
keywords: DEFGRID2
keywords: scfconv7
keywords: smallprint printgap noloewdin
keywords: NOSOSCF
formula: C22H23NO3
InChI: InChI=1/C22H23NO3/c1-21(2)19(22(21,3)4)20(24)26-18(14-23)15-9-8-12-17(13-15)25-16-10-6-5-7-11-16/h5-13,18-19H,1-4H3
49 atoms
O  0.387106 1.69205 -0.655438
O  -0.076731 2.185679 1.459797
O  -2.517035 -2.384327 0.245702
N  -1.336585 4.615959 -0.487634
C  2.801797 0.09907 0.32801
C  3.335829 1.491782 0.229455
C  2.0348 1.240865 0.997195
C  2.265027 -0.62604 -0.884998
C  3.433937 -0.884796 1.290619
C  4.510481 1.914859 1.085355
C  3.3402 2.238994 -1.08407
C  0.704948 1.745748 0.647519
C  -0.916523 2.090397 -1.029911
C  -2.007513 1.171838 -0.513619
C  -1.148211 3.498451 -0.684013
C  -1.717967 -0.18115 -0.364511
C  -3.286365 1.646878 -0.272283
C  -2.716815 -1.051046 0.047186
C  -4.277112 0.759156 0.129257
C  -4.004142 -0.585107 0.294002
C  -1.293681 -2.949444 -0.05043
C  -0.9850 -3.284182 -1.360325
C  -0.419471 -3.229262 0.987288
C  0.217009 -3.92425 -1.627716
C  0.776903 -3.876982 0.707831
C  1.097728 -4.22501 -0.596934
H  2.157433 1.274575 2.074068
H  1.447321 -1.290402 -0.601117
H  1.910769 0.011059 -1.68847
H  3.057422 -1.253395 -1.298561
H  4.32217 -1.337155 0.844523
H  3.726426 -0.439674 2.238926
H  2.733023 -1.691309 1.513569
H  4.48588 1.50184 2.091107
H  5.448848 1.607667 0.619349
H  4.532892 3.001612 1.181188
H  2.587477 1.923279 -1.799004
H  3.206217 3.308612 -0.913637
H  4.312422 2.107559 -1.56346
H  -0.907267 2.045477 -2.122517
H  -0.721924 -0.552004 -0.564197
H  -3.528215 2.694812 -0.389895
H  -5.276432 1.124751 0.321474
H  -4.777131 -1.271396 0.614659
H  -1.679282 -3.058921 -2.159942
H  -0.676433 -2.95893 2.00349
H  0.460525 -4.194143 -2.646768
H  1.459093 -4.107248 1.515344
H  2.030475 -4.729666 -0.810501
elementType: O N C H
totalener: -1132.68050072 hartree
nucrepener: 2355.73596597 hartree
electener: -3488.41646669 hartree
oneelecener: -6220.17538840 hartree
twoeener: 2731.75892171 hartree
cpcmener: -0.03932943 hartree
kineticenergy: 1127.66967954 hartree
xcener: -110.669449083443 hartree
chargesum: -0.0000000
charge: -0.285032 -0.474023 -0.334481 -0.094907 0.148949 0.099637 -0.131336 -0.275001 -0.302972 -0.290595 -0.292936 0.407085 0.467699 -0.055083 -0.235581 -0.217234 -0.228434 0.320677 -0.096170 -0.262557 0.223178 -0.160771 -0.146208 -0.151018 -0.193805 -0.144824 0.086319 0.018212 0.107793 0.114212 0.100151 0.096783 0.094233 0.092579 0.099775 0.096797 0.093835 0.102842 0.098420 0.143376 0.127080 0.135096 0.161635 0.146502 0.154549 0.151094 0.160581 0.162751 0.161129
qa: -0.2850 -0.4740 -0.3345 -0.0949 0.1489 0.0996 -0.1313 -0.2750 -0.3030 -0.2906 -0.2929 0.4071 0.4677 -0.0551 -0.2356 -0.2172 -0.2284 0.3207 -0.0962 -0.2626 0.2232 -0.1608 -0.1462 -0.1510 -0.1938 -0.1448 0.0863 0.0182 0.1078 0.1142 0.1002 0.0968 0.0942 0.0926 0.0998 0.0968 0.0938 0.1028 0.0984 0.1434 0.1271 0.1351 0.1616 0.1465 0.1545 0.1511 0.1606 0.1628 0.1611
va: 2.1266 2.0256 2.0808 3.1012 3.6092 3.7214 3.9416 3.8915 3.9190 3.9115 3.9048 4.0948 3.8062 3.8437 4.1089 3.9322 3.9612 3.7008 3.9099 4.0109 3.7307 3.9266 3.9092 3.8551 3.8525 3.8041 1.0300 1.0244 1.0171 0.9997 0.9991 1.0072 1.0050 1.0064 0.9986 1.0015 1.0127 0.9997 0.9983 0.9914 1.0145 1.0160 0.9882 1.0092 0.9981 1.0007 0.9891 0.9886 0.9903
dispcorr: -0.028882004 hartree
energy: -1132.709382728939
dipole: 28.55261 -26.71461 1.83799 -5.79188 3.29704 -2.49484 -0.67079 -0.79841 -1.46921
magnitude: 3.42943 au
magnitude: 8.71692 debye
