program: Orca
programVersion: 5.0.2
elementType: O O O N C C C C C C C C C C C C C C C C C C C C C C H H H H H H H H H H H H H H H H H H H H H H H
charge: 0
multiplicity: 1
keywords: wb97x-d3
keywords: def2-TZVPP
keywords: def2/J RIJCOSX
keywords: DEFGRID2
keywords: scfconv7
keywords: smallprint printgap noloewdin
keywords: NOSOSCF
formula: C22H23NO3
InChI: InChI=1/C22H23NO3/c1-21(2)19(22(21,3)4)20(24)26-18(14-23)15-9-8-12-17(13-15)25-16-10-6-5-7-11-16/h5-13,18-19H,1-4H3
49 atoms
O  0.699335 1.422622 0.61371
O  0.749255 2.766783 -1.169214
O  -2.230885 -2.736077 -0.703059
N  -1.254523 1.251985 3.271419
C  3.593457 1.606802 -1.721641
C  3.881745 2.604146 -0.646971
C  2.736586 1.604363 -0.458565
C  3.029673 2.036761 -3.056678
C  4.493569 0.401029 -1.887602
C  5.072036 2.409103 0.265989
C  3.587289 4.072689 -0.84496
C  1.33115 2.015328 -0.425207
C  -0.689148 1.695226 0.758281
C  -1.529927 0.815743 -0.134448
C  -0.988296 1.440331 2.168518
C  -1.478908 -0.563924 0.029092
C  -2.320572 1.383457 -1.122882
C  -2.250601 -1.371134 -0.792528
C  -3.072643 0.560052 -1.949371
C  -3.047105 -0.814977 -1.786001
C  -2.129451 -3.342891 0.52653
C  -1.321227 -4.466777 0.61135
C  -2.848989 -2.898228 1.62918
C  -1.233606 -5.153394 1.814467
C  -2.741192 -3.587482 2.828234
C  -1.935983 -4.714623 2.928303
H  2.959697 0.804211 0.238026
H  2.379523 1.260713 -3.46426
H  2.467009 2.964242 -3.042038
H  3.85354 2.169281 -3.760765
H  3.978826 -0.373857 -2.458469
H  5.395975 0.671052 -2.439827
H  4.800437 -0.045074 -0.943812
H  5.235703 1.371489 0.549396
H  5.982784 2.77192 -0.214868
H  4.937078 2.979242 1.18681
H  3.356214 4.542971 0.112549
H  4.474989 4.567944 -1.243313
H  2.766717 4.288887 -1.522261
H  -0.911248 2.749841 0.56851
H  -0.848683 -1.002399 0.794428
H  -2.353206 2.458055 -1.245555
H  -3.691391 0.993036 -2.723615
H  -3.641089 -1.457225 -2.42344
H  -0.770372 -4.803555 -0.2576
H  -3.490004 -2.028263 1.561532
H  -0.605524 -6.03209 1.879228
H  -3.298839 -3.240365 3.688123
H  -1.859735 -5.247679 3.866382
elementType: O N C H
totalener: -1132.68435195 hartree
nucrepener: 2227.66432608 hartree
electener: -3360.34867803 hartree
oneelecener: -5964.62378639 hartree
twoeener: 2604.27510836 hartree
cpcmener: -0.03229935 hartree
kineticenergy: 1127.65286869 hartree
xcener: -110.658776289630 hartree
chargesum: -0.0000000
charge: -0.297476 -0.482811 -0.339366 -0.104984 0.102022 0.099891 -0.111366 -0.302287 -0.286542 -0.282841 -0.301701 0.397015 0.437961 0.016855 -0.224692 -0.199910 -0.199084 0.241753 -0.120233 -0.233093 0.286569 -0.252530 -0.192103 -0.124388 -0.146449 -0.188383 0.087310 0.102186 0.096373 0.097864 0.096189 0.099631 0.093001 0.091903 0.100808 0.095019 0.102963 0.101067 0.097156 0.140228 0.148762 0.149908 0.162793 0.150709 0.149653 0.157882 0.161894 0.163465 0.161406
qa: -0.2975 -0.4828 -0.3394 -0.1050 0.1020 0.0999 -0.1114 -0.3023 -0.2865 -0.2828 -0.3017 0.3970 0.4380 0.0169 -0.2247 -0.1999 -0.1991 0.2418 -0.1202 -0.2331 0.2866 -0.2525 -0.1921 -0.1244 -0.1464 -0.1884 0.0873 0.1022 0.0964 0.0979 0.0962 0.0996 0.0930 0.0919 0.1008 0.0950 0.1030 0.1011 0.0972 0.1402 0.1488 0.1499 0.1628 0.1507 0.1497 0.1579 0.1619 0.1635 0.1614
va: 2.1237 2.0192 2.0676 3.1078 3.6918 3.7113 3.9124 3.9043 3.9111 3.9072 3.9132 4.0984 3.7100 3.5845 4.0770 3.9591 3.9497 3.7614 3.9025 4.0103 3.6787 4.0095 3.9006 3.8781 3.8841 3.9007 1.0321 0.9991 1.0116 0.9986 1.0021 0.9984 1.0053 1.0056 0.9987 1.0024 0.9988 0.9981 1.0121 1.0178 1.0117 1.0064 0.9881 1.0039 1.0068 0.9967 0.9878 0.9887 0.9894
dispcorr: -0.023745332 hartree
energy: -1132.708097279243
dipole: 28.99440 -27.87296 1.12144 9.75224 -9.83951 -0.08727 -10.54051 9.50386 -1.03666
magnitude: 1.52968 au
magnitude: 3.88813 debye
