program: Orca
programVersion: 5.0.2
elementType: O O O N C C C C C C C C C C C C C C C C C C C C C C H H H H H H H H H H H H H H H H H H H H H H H
charge: 0
multiplicity: 1
keywords: wb97x-d3
keywords: def2-TZVPP
keywords: def2/J RIJCOSX
keywords: DEFGRID2
keywords: scfconv7
keywords: smallprint printgap noloewdin
keywords: NOSOSCF
formula: C22H23NO3
InChI: InChI=1/C22H23NO3/c1-21(2)19(22(21,3)4)20(24)26-18(14-23)15-9-8-12-17(13-15)25-16-10-6-5-7-11-16/h5-13,18-19H,1-4H3
49 atoms
O  0.279734 1.863958 -0.219263
O  1.116105 3.726001 0.660464
O  -2.668525 -2.312545 -0.321744
N  -1.504195 2.541799 2.600783
C  3.136033 0.779369 0.506527
C  2.997489 0.881861 -0.980768
C  2.629393 2.083452 -0.120535
C  2.200533 -0.094085 1.312004
C  4.501226 0.847453 1.153172
C  4.233481 1.077469 -1.835493
C  1.976363 0.046421 -1.723132
C  1.299911 2.643852 0.149324
C  -1.042079 2.311321 0.034292
C  -1.971829 1.278749 -0.550634
C  -1.271014 2.449736 1.478032
C  -1.87628 -0.040606 -0.119682
C  -2.881554 1.643627 -1.529371
C  -2.68999 -1.000604 -0.699923
C  -3.706516 0.672685 -2.084078
C  -3.610353 -0.647441 -1.681895
C  -1.509176 -2.854511 0.187513
C  -0.319523 -2.803207 -0.527656
C  -1.580747 -3.502734 1.409899
C  0.811512 -3.408005 0.000333
C  -0.444273 -4.116904 1.919966
C  0.754421 -4.067159 1.222432
H  3.369092 2.877213 -0.1169
H  1.193425 -0.180891 0.914091
H  2.610198 -1.104173 1.378005
H  2.116597 0.28809 2.331143
H  5.177104 1.546537 0.664986
H  4.409994 1.158234 2.195455
H  4.974312 -0.136668 1.144362
H  4.744532 0.126089 -1.995863
H  3.950465 1.46607 -2.815617
H  4.952303 1.774995 -1.409769
H  1.116521 -0.261941 -1.138323
H  1.608734 0.575928 -2.603862
H  2.4656 -0.864098 -2.076316
H  -1.225001 3.287843 -0.424124
H  -1.171552 -0.310128 0.658761
H  -2.944101 2.671847 -1.860943
H  -4.420164 0.945375 -2.849569
H  -4.243235 -1.406209 -2.124045
H  -0.273065 -2.30093 -1.485938
H  -2.51629 -3.531942 1.95358
H  1.741152 -3.366248 -0.552114
H  -0.498761 -4.628323 2.871928
H  1.638547 -4.542529 1.625691
elementType: O N C H
totalener: -1132.68242398 hartree
nucrepener: 2342.92707402 hartree
electener: -3475.60949800 hartree
oneelecener: -6194.16983165 hartree
twoeener: 2718.56033365 hartree
cpcmener: -0.03851852 hartree
kineticenergy: 1127.66310184 hartree
xcener: -110.662907755245 hartree
chargesum: -0.0000000
charge: -0.255814 -0.480862 -0.338755 -0.098298 0.123619 0.141862 -0.172226 -0.281947 -0.285854 -0.297664 -0.249075 0.424498 0.387532 0.010271 -0.222551 -0.240073 -0.200090 0.265017 -0.113770 -0.234848 0.277133 -0.193420 -0.232303 -0.169975 -0.127610 -0.169869 0.089038 0.049288 0.103846 0.108239 0.092098 0.096135 0.099190 0.099608 0.096980 0.093453 0.024379 0.107182 0.100611 0.134003 0.171700 0.150852 0.161850 0.150127 0.169626 0.149015 0.164154 0.161956 0.161742
qa: -0.2558 -0.4809 -0.3388 -0.0983 0.1236 0.1419 -0.1722 -0.2819 -0.2859 -0.2977 -0.2491 0.4245 0.3875 0.0103 -0.2226 -0.2401 -0.2001 0.2650 -0.1138 -0.2348 0.2771 -0.1934 -0.2323 -0.1700 -0.1276 -0.1699 0.0890 0.0493 0.1038 0.1082 0.0921 0.0961 0.0992 0.0996 0.0970 0.0935 0.0244 0.1072 0.1006 0.1340 0.1717 0.1509 0.1618 0.1501 0.1696 0.1490 0.1642 0.1620 0.1617
va: 2.1667 2.0178 2.0774 3.1070 3.6991 3.6714 3.9483 3.9288 3.9090 3.9104 3.9136 4.1140 3.7827 3.6800 4.0223 3.9095 3.9428 3.7678 3.8981 4.0064 3.6867 3.8710 4.0085 3.8430 3.8747 3.8770 1.0292 1.0020 0.9979 1.0066 1.0054 1.0020 0.9987 0.9987 1.0015 1.0056 0.9991 1.0074 0.9987 1.0185 0.9889 1.0000 0.9881 1.0052 0.9863 1.0058 0.9908 0.9873 0.9890
dispcorr: -0.028760220 hartree
energy: -1132.711184197300
dipole: 26.52225 -25.48006 1.04219 -6.24153 4.67687 -1.56466 -5.51900 3.20941 -2.30958
magnitude: 2.97800 au
magnitude: 7.56948 debye
