program: Orca
programVersion: 5.0.2
elementType: O O O N C C C C C C C C C C C C C C C C C C C C C C H H H H H H H H H H H H H H H H H H H H H H H
charge: 0
multiplicity: 1
keywords: wb97x-d3
keywords: def2-TZVPP
keywords: def2/J RIJCOSX
keywords: DEFGRID2
keywords: scfconv7
keywords: smallprint printgap noloewdin
keywords: NOSOSCF
formula: C22H23NO3
InChI: InChI=1/C22H23NO3/c1-21(2)19(22(21,3)4)20(24)26-18(14-23)15-9-8-12-17(13-15)25-16-10-6-5-7-11-16/h5-13,18-19H,1-4H3
49 atoms
O  0.015385 1.385748 -0.734838
O  1.239013 3.181014 -0.233332
O  -3.011941 -2.395151 0.461185
N  -1.269089 3.032076 1.989969
C  3.746692 1.453518 -1.06542
C  3.341568 0.744173 0.189351
C  2.286345 1.09248 -0.867662
C  4.234674 2.88359 -1.011083
C  4.448499 0.690135 -2.168394
C  3.615195 -0.731694 0.372366
C  3.366107 1.475877 1.511494
C  1.192228 2.02662 -0.583227
C  -1.192016 2.067096 -0.442376
C  -2.298893 1.047837 -0.574455
C  -1.188783 2.610072 0.922496
C  -2.146928 -0.178342 0.061707
C  -3.426778 1.31979 -1.331523
C  -3.111677 -1.157423 -0.11059
C  -4.408743 0.343867 -1.455014
C  -4.252892 -0.897522 -0.861648
C  -1.768585 -2.918931 0.73792
C  -0.740321 -2.89638 -0.197328
C  -1.590759 -3.518367 1.974878
C  0.484534 -3.458355 0.130422
C  -0.366031 -4.097339 2.280987
C  0.677772 -4.060565 1.367516
H  1.952099 0.231884 -1.437083
H  3.776984 3.495964 -0.241318
H  5.311708 2.885678 -0.831201
H  4.066925 3.379083 -1.969005
H  4.329256 1.21293 -3.119095
H  5.518749 0.618995 -1.964685
H  4.067607 -0.320056 -2.306774
H  2.913692 -1.156141 1.093709
H  3.519794 -1.306217 -0.546752
H  4.622705 -0.889706 0.763038
H  3.078298 2.522112 1.458472
H  2.698045 0.990446 2.225069
H  4.373647 1.438379 1.930794
H  -1.353343 2.901104 -1.132377
H  -1.273117 -0.369502 0.671866
H  -3.537166 2.27566 -1.826715
H  -5.295554 0.544749 -2.040742
H  -5.007727 -1.6642 -0.981205
H  -0.883487 -2.440942 -1.168998
H  -2.402867 -3.534558 2.690672
H  1.290987 -3.42735 -0.590796
H  -0.228825 -4.568481 3.245309
H  1.634567 -4.500629 1.614516
elementType: O N C H
totalener: -1132.68263139 hartree
nucrepener: 2283.64289728 hartree
electener: -3416.32552867 hartree
oneelecener: -6076.14770181 hartree
twoeener: 2659.82217314 hartree
cpcmener: -0.03708589 hartree
kineticenergy: 1127.65079112 hartree
xcener: -110.659635764965 hartree
chargesum: -0.0000000
charge: -0.283056 -0.471049 -0.337009 -0.104125 0.109967 0.132843 -0.167026 -0.309832 -0.282886 -0.297434 -0.299891 0.421665 0.432293 0.000333 -0.235614 -0.211686 -0.213002 0.270600 -0.108248 -0.242343 0.291049 -0.198323 -0.247089 -0.156741 -0.120995 -0.184947 0.089840 0.096216 0.098974 0.100883 0.095695 0.099350 0.092552 0.091498 0.093342 0.104187 0.094459 0.100894 0.106048 0.139519 0.146899 0.150738 0.162068 0.150154 0.159812 0.148945 0.166461 0.161761 0.162253
qa: -0.2831 -0.4710 -0.3370 -0.1041 0.1100 0.1328 -0.1670 -0.3098 -0.2829 -0.2974 -0.2999 0.4217 0.4323 0.0003 -0.2356 -0.2117 -0.2130 0.2706 -0.1082 -0.2423 0.2910 -0.1983 -0.2471 -0.1567 -0.1210 -0.1849 0.0898 0.0962 0.0990 0.1009 0.0957 0.0994 0.0926 0.0915 0.0933 0.1042 0.0945 0.1009 0.1060 0.1395 0.1469 0.1507 0.1621 0.1502 0.1598 0.1489 0.1665 0.1618 0.1623
va: 2.1470 2.0264 2.0744 3.1084 3.7239 3.6936 3.9492 3.8993 3.9025 3.9093 3.9158 4.0930 3.7483 3.7350 4.0310 3.9311 3.9559 3.7664 3.8907 4.0076 3.6699 3.9099 4.0137 3.8585 3.8745 3.8904 1.0333 1.0116 0.9982 0.9997 1.0025 0.9990 1.0049 1.0019 1.0030 1.0010 1.0125 1.0011 0.9981 1.0111 1.0178 1.0019 0.9881 1.0049 0.9951 1.0066 0.9865 0.9876 0.9896
dispcorr: -0.025240931 hartree
energy: -1132.707872323675
dipole: 31.19015 -30.38311 0.80705 -1.62299 -0.16677 -1.78976 -4.29630 2.29260 -2.00370
magnitude: 2.80524 au
magnitude: 7.13035 debye
