program: Orca
programVersion: 5.0.2
elementType: O O O N C C C C C C C C C C C C C C C C C C C C C C H H H H H H H H H H H H H H H H H H H H H H H
charge: 0
multiplicity: 1
keywords: wb97x-d3
keywords: def2-TZVPP
keywords: def2/J RIJCOSX
keywords: DEFGRID2
keywords: scfconv7
keywords: smallprint printgap noloewdin
keywords: NOSOSCF
formula: C22H23NO3
InChI: InChI=1/C22H23NO3/c1-21(2)19(22(21,3)4)20(24)26-18(14-23)15-9-8-12-17(13-15)25-16-10-6-5-7-11-16/h5-13,18-19H,1-4H3
49 atoms
O  0.251357 2.423286 0.644522
O  1.427358 0.554965 0.348786
O  -2.256324 -2.523052 -1.156156
N  -0.25186 0.224895 3.216925
C  3.846659 2.479054 -0.212408
C  3.190785 2.352285 -1.548102
C  2.335774 2.684644 -0.322422
C  4.419574 1.272485 0.494314
C  4.642919 3.722342 0.121703
C  3.321033 3.466639 -2.562986
C  3.069331 1.011606 -2.234417
C  1.351524 1.753765 0.230238
C  -0.848055 1.655519 1.109597
C  -1.526336 0.877474 0.00362
C  -0.478765 0.833365 2.26694
C  -1.552941 -0.509238 -0.020493
C  -2.134713 1.609674 -1.01045
C  -2.215514 -1.160202 -1.05421
C  -2.768345 0.945498 -2.048408
C  -2.82128 -0.43962 -2.073176
C  -2.225754 -3.301885 -0.023067
C  -1.384749 -4.403908 -0.032944
C  -3.042522 -3.037482 1.069285
C  -1.36216 -5.252467 1.065553
C  -2.997353 -3.884868 2.166428
C  -2.159384 -4.992734 2.171278
H  2.017792 3.719663 -0.267887
H  5.478195 1.182611 0.242404
H  4.354437 1.400192 1.576365
H  3.948164 0.327248 0.246141
H  4.748859 3.819615 1.203667
H  5.647219 3.655953 -0.301706
H  4.18773 4.641524 -0.241572
H  4.262525 3.374736 -3.108369
H  2.511915 3.406394 -3.293009
H  3.28567 4.460988 -2.122938
H  3.935269 0.862195 -2.882352
H  3.014897 0.157581 -1.567073
H  2.18192 0.990883 -2.869685
H  -1.549957 2.402345 1.489972
H  -1.06521 -1.083556 0.756958
H  -2.120608 2.691934 -0.988628
H  -3.242948 1.510483 -2.839328
H  -3.328503 -0.959127 -2.875962
H  -0.758036 -4.59863 -0.893871
H  -3.708615 -2.183802 1.070219
H  -0.708465 -6.11466 1.056705
H  -3.628701 -3.677235 3.020259
H  -2.132226 -5.650496 3.029574
elementType: O N C H
totalener: -1132.68315189 hartree
nucrepener: 2258.14810691 hartree
electener: -3390.83125880 hartree
oneelecener: -6026.47449865 hartree
twoeener: 2635.64323986 hartree
cpcmener: -0.03607433 hartree
kineticenergy: 1127.65624940 hartree
xcener: -110.662886906019 hartree
chargesum: 0.0000000
charge: -0.297118 -0.478992 -0.337125 -0.097971 0.100534 0.097793 -0.120509 -0.302965 -0.283115 -0.283830 -0.300580 0.419475 0.492370 -0.041433 -0.243898 -0.150779 -0.260495 0.258010 -0.113550 -0.244363 0.283542 -0.246834 -0.195036 -0.125869 -0.143379 -0.185482 0.087134 0.099487 0.102096 0.097440 0.095468 0.099938 0.093133 0.099546 0.096038 0.092810 0.101091 0.098411 0.101530 0.147986 0.134871 0.147383 0.162594 0.150351 0.149213 0.159131 0.161369 0.162951 0.161630
qa: -0.2971 -0.4790 -0.3371 -0.0980 0.1005 0.0978 -0.1205 -0.3030 -0.2831 -0.2838 -0.3006 0.4195 0.4924 -0.0414 -0.2439 -0.1508 -0.2605 0.2580 -0.1135 -0.2444 0.2835 -0.2468 -0.1950 -0.1259 -0.1434 -0.1855 0.0871 0.0995 0.1021 0.0974 0.0955 0.0999 0.0931 0.0995 0.0960 0.0928 0.1011 0.0984 0.1015 0.1480 0.1349 0.1474 0.1626 0.1504 0.1492 0.1591 0.1614 0.1630 0.1616
va: 2.1280 2.0243 2.0715 3.1042 3.7030 3.7038 3.9434 3.9083 3.9049 3.9056 3.9094 4.0580 3.8211 3.6879 4.0774 3.8651 3.9917 3.8050 3.8929 4.0137 3.6771 4.0107 3.9131 3.8773 3.8809 3.8982 1.0330 0.9982 0.9990 1.0123 1.0023 0.9986 1.0054 0.9989 1.0025 1.0054 0.9983 1.0118 0.9990 0.9911 1.0233 1.0066 0.9876 1.0050 1.0067 0.9957 0.9882 0.9888 0.9893
dispcorr: -0.024350362 hartree
energy: -1132.707502252455
dipole: 25.71319 -25.87349 -0.16029 13.64153 -11.62170 2.01983 -10.04378 8.53489 -1.50889
magnitude: 2.52629 au
magnitude: 6.42132 debye
