program: Orca
programVersion: 5.0.2
elementType: O O O N C C C C C C C C C C C C C C C C C C C C C C H H H H H H H H H H H H H H H H H H H H H H H
charge: 0
multiplicity: 1
keywords: wb97x-d3
keywords: def2-TZVPP
keywords: def2/J RIJCOSX
keywords: DEFGRID2
keywords: scfconv7
keywords: smallprint printgap noloewdin
keywords: NOSOSCF
formula: C22H23NO3
InChI: InChI=1/C22H23NO3/c1-21(2)19(22(21,3)4)20(24)26-18(14-23)15-9-8-12-17(13-15)25-16-10-6-5-7-11-16/h5-13,18-19H,1-4H3
49 atoms
O  0.309746 2.003541 -0.085939
O  0.329306 1.230513 -2.171078
O  -2.525651 -2.092549 0.762989
N  -1.565036 3.908926 1.827134
C  3.308153 1.529995 0.053136
C  2.766966 0.181096 0.40379
C  2.258841 0.889707 -0.856055
C  2.99884 2.739822 0.907287
C  4.688434 1.653308 -0.558061
C  3.611769 -1.050369 0.155069
C  1.885409 -0.019181 1.614928
C  0.896793 1.371848 -1.111933
C  -1.018528 2.45738 -0.277984
C  -2.027421 1.335184 -0.387787
C  -1.308075 3.26841 0.906919
C  -1.807914 0.139665 0.276763
C  -3.176288 1.521554 -1.144591
C  -2.726917 -0.889246 0.135852
C  -4.107803 0.498414 -1.2357
C  -3.882583 -0.719315 -0.609646
C  -1.323155 -2.73346 0.588111
C  -0.583489 -2.626182 -0.584329
C  -0.888482 -3.544876 1.627138
C  0.601617 -3.337587 -0.703866
C  0.294964 -4.256054 1.488436
C  1.048273 -4.153303 0.326979
H  2.667642 0.47797 -1.772406
H  3.8276 2.899151 1.600107
H  2.918285 3.636895 0.291141
H  2.096134 2.664659 1.504756
H  4.909896 0.88208 -1.292568
H  4.789579 2.616607 -1.061063
H  5.455659 1.608332 0.21728
H  2.98125 -1.940787 0.131322
H  4.162404 -1.018644 -0.782722
H  4.334528 -1.182273 0.963121
H  1.255151 0.824762 1.87405
H  1.236298 -0.885111 1.469051
H  2.512596 -0.231038 2.482706
H  -1.093025 3.113069 -1.152053
H  -0.925478 -0.00843 0.887284
H  -3.339547 2.457424 -1.663711
H  -5.005013 0.638199 -1.823311
H  -4.592594 -1.530608 -0.705125
H  -0.917477 -2.001064 -1.402408
H  -1.47489 -3.62194 2.533874
H  1.176514 -3.251329 -1.616533
H  0.630698 -4.888424 2.299825
H  1.973673 -4.703814 0.224543
elementType: O N C H
totalener: -1132.68073885 hartree
nucrepener: 2365.43007514 hartree
electener: -3498.11081399 hartree
oneelecener: -6239.43001355 hartree
twoeener: 2741.31919956 hartree
cpcmener: -0.03484276 hartree
kineticenergy: 1127.66179494 hartree
xcener: -110.664777620295 hartree
chargesum: -0.0000000
charge: -0.270434 -0.478388 -0.341482 -0.100102 0.123040 0.117924 -0.132190 -0.291955 -0.297344 -0.285380 -0.297337 0.400820 0.364145 0.015661 -0.217971 -0.176687 -0.205349 0.204255 -0.121979 -0.209466 0.273424 -0.164116 -0.230362 -0.191613 -0.125416 -0.178546 0.086974 0.097445 0.103413 0.089924 0.093492 0.097698 0.099397 0.082536 0.094862 0.102662 0.097821 0.062097 0.113980 0.150033 0.193618 0.148932 0.162743 0.151501 0.151163 0.147164 0.165644 0.161661 0.162088
qa: -0.2704 -0.4784 -0.3415 -0.1001 0.1230 0.1179 -0.1322 -0.2920 -0.2973 -0.2854 -0.2973 0.4008 0.3641 0.0157 -0.2180 -0.1767 -0.2053 0.2043 -0.1220 -0.2095 0.2734 -0.1641 -0.2304 -0.1916 -0.1254 -0.1785 0.0870 0.0974 0.1034 0.0899 0.0935 0.0977 0.0994 0.0825 0.0949 0.1027 0.0978 0.0621 0.1140 0.1500 0.1936 0.1489 0.1627 0.1515 0.1512 0.1472 0.1656 0.1617 0.1621
va: 2.1207 2.0156 2.0680 3.1060 3.7092 3.6465 3.9224 3.9129 3.9099 3.9086 3.9128 4.1050 3.7658 3.5980 4.0717 3.9346 3.9884 3.7975 3.8793 3.9969 3.6811 3.8194 3.9767 3.8563 3.8862 3.8452 1.0291 0.9987 1.0006 1.0061 1.0060 1.0011 0.9988 1.0145 1.0073 1.0002 1.0072 1.0126 1.0014 1.0142 0.9749 1.0001 0.9876 1.0020 1.0053 1.0076 0.9893 0.9873 0.9892
dispcorr: -0.029554126 hartree
energy: -1132.710292974867
dipole: 27.97206 -26.57954 1.39252 -3.22775 2.37632 -0.85143 1.93800 -2.56694 -0.62894
magnitude: 1.74917 au
magnitude: 4.44604 debye
