program: Orca
programVersion: 5.0.2
elementType: O O O N C C C C C C C C C C C C C C C C C C C C C C H H H H H H H H H H H H H H H H H H H H H H H
charge: 0
multiplicity: 1
keywords: wb97x-d3
keywords: def2-TZVPP
keywords: def2/J RIJCOSX
keywords: DEFGRID2
keywords: scfconv7
keywords: smallprint printgap noloewdin
keywords: NOSOSCF
formula: C22H23NO3
InChI: InChI=1/C22H23NO3/c1-21(2)19(22(21,3)4)20(24)26-18(14-23)15-9-8-12-17(13-15)25-16-10-6-5-7-11-16/h5-13,18-19H,1-4H3
49 atoms
O  0.57281 2.070661 0.983392
O  1.940876 0.67865 -0.090377
O  -2.372528 -2.822642 -1.016535
N  1.028856 -0.770727 2.793596
C  3.823828 3.161956 -0.444337
C  2.854058 3.325133 -1.568394
C  2.327911 3.059083 -0.153726
C  4.720927 1.948978 -0.355461
C  4.508669 4.378052 0.141282
C  2.556375 4.701509 -2.120971
C  2.721041 2.273866 -2.64489
C  1.654652 1.812196 0.207086
C  -0.251709 0.973941 1.322658
C  -0.963587 0.362203 0.129904
C  0.495499 -0.010226 2.115221
C  -1.310469 -0.981346 0.127021
C  -1.33041 1.181461 -0.932224
C  -2.035508 -1.498958 -0.939938
C  -2.028853 0.641479 -2.001278
C  -2.393244 -0.695306 -2.011384
C  -2.729399 -3.512646 0.117555
C  -2.273016 -4.81757 0.231119
C  -3.562273 -2.963148 1.084572
C  -2.654146 -5.580073 1.326319
C  -3.924297 -3.73353 2.18024
C  -3.474262 -5.041144 2.307824
H  1.899133 3.928013 0.332601
H  5.67941 2.182158 -0.822889
H  4.921798 1.701029 0.688042
H  4.336311 1.056706 -0.838153
H  4.885072 4.150732 1.140219
H  5.36355 4.667204 -0.47324
H  3.855309 5.243357 0.231926
H  1.59241 4.700334 -2.632693
H  2.517368 5.476876 -1.358843
H  3.315515 4.9889 -2.851272
H  1.704931 2.270076 -3.043392
H  3.392874 2.517816 -3.469961
H  2.952116 1.261429 -2.328987
H  -1.0023 1.395976 1.997469
H  -1.020961 -1.629101 0.945696
H  -1.077074 2.232937 -0.940571
H  -2.305638 1.274832 -2.83329
H  -2.947096 -1.113066 -2.842093
H  -1.629474 -5.233719 -0.533381
H  -3.93023 -1.949295 0.99053
H  -2.299382 -6.598625 1.412637
H  -4.570178 -3.305809 2.935734
H  -3.763894 -5.635503 3.163943
elementType: O N C H
totalener: -1132.68299191 hartree
nucrepener: 2233.71601204 hartree
electener: -3366.39900395 hartree
oneelecener: -5977.18567909 hartree
twoeener: 2610.78667514 hartree
cpcmener: -0.03748285 hartree
kineticenergy: 1127.65027922 hartree
xcener: -110.663081248522 hartree
chargesum: -0.0000000
charge: -0.304107 -0.469862 -0.338315 -0.097077 0.100399 0.095094 -0.084502 -0.305442 -0.282924 -0.282316 -0.297436 0.371302 0.527026 -0.027353 -0.250964 -0.201467 -0.282169 0.287975 -0.100030 -0.248378 0.285683 -0.252874 -0.192390 -0.124333 -0.145460 -0.188775 0.088531 0.099195 0.102869 0.097975 0.095887 0.100112 0.093363 0.095924 0.092332 0.100362 0.096974 0.103247 0.098491 0.151552 0.136485 0.149078 0.162064 0.149571 0.149269 0.158904 0.161454 0.163360 0.161699
qa: -0.3041 -0.4699 -0.3383 -0.0971 0.1004 0.0951 -0.0845 -0.3054 -0.2829 -0.2823 -0.2974 0.3713 0.5270 -0.0274 -0.2510 -0.2015 -0.2822 0.2880 -0.1000 -0.2484 0.2857 -0.2529 -0.1924 -0.1243 -0.1455 -0.1888 0.0885 0.0992 0.1029 0.0980 0.0959 0.1001 0.0934 0.0959 0.0923 0.1004 0.0970 0.1032 0.0985 0.1516 0.1365 0.1491 0.1621 0.1496 0.1493 0.1589 0.1615 0.1634 0.1617
va: 2.1221 2.0251 2.0679 3.1015 3.7280 3.7117 3.9022 3.9075 3.9035 3.9034 3.9074 4.0789 3.7677 3.7297 4.1213 3.9449 3.9863 3.7463 3.8851 4.0272 3.6810 4.0063 3.9037 3.8766 3.8835 3.8994 1.0340 0.9986 0.9986 1.0116 1.0020 0.9989 1.0054 1.0025 1.0056 0.9987 1.0015 0.9990 1.0119 0.9854 1.0171 1.0109 0.9883 1.0053 1.0070 0.9957 0.9880 0.9888 0.9893
dispcorr: -0.024471916 hartree
energy: -1132.707463823591
dipole: 20.55871 -21.51962 -0.96091 22.14327 -19.62616 2.51711 -10.63457 9.84911 -0.78546
magnitude: 2.80645 au
magnitude: 7.13342 debye
