program: Orca
programVersion: 5.0.2
elementType: O O O N C C C C C C C C C C C C C C C C C C C C C C H H H H H H H H H H H H H H H H H H H H H H H
charge: 0
multiplicity: 1
keywords: wb97x-d3
keywords: def2-TZVPP
keywords: def2/J RIJCOSX
keywords: DEFGRID2
keywords: scfconv7
keywords: smallprint printgap noloewdin
keywords: NOSOSCF
formula: C22H23NO3
InChI: InChI=1/C22H23NO3/c1-21(2)19(22(21,3)4)20(24)26-18(14-23)15-9-8-12-17(13-15)25-16-10-6-5-7-11-16/h5-13,18-19H,1-4H3
49 atoms
O  0.336525 1.90148 0.0990
O  0.349998 2.043104 -2.120906
O  -2.388835 -2.331669 -0.615857
N  -1.519105 2.964175 2.599452
C  3.380452 1.550805 -0.040769
C  2.840745 0.158256 -0.102264
C  2.289287 1.216779 -1.059723
C  3.106149 2.442979 1.148528
C  4.736769 1.864575 -0.635211
C  3.646546 -0.938794 -0.766424
C  2.014414 -0.411556 1.027804
C  0.92385 1.750703 -1.096592
C  -1.004737 2.35067 0.110625
C  -1.996964 1.30434 -0.354163
C  -1.274692 2.687931 1.510312
C  -1.691854 -0.045234 -0.235728
C  -3.218833 1.717171 -0.862027
C  -2.622686 -0.987445 -0.650518
C  -4.143436 0.761411 -1.260421
C  -3.853735 -0.588432 -1.159995
C  -1.321461 -2.821858 0.106862
C  -0.29134 -3.442669 -0.580659
C  -1.312656 -2.740607 1.49256
C  0.759124 -4.004812 0.133962
C  -0.252029 -3.29513 2.193694
C  0.783487 -3.930182 1.519426
H  2.660706 1.118447 -2.07388
H  3.938033 2.361999 1.850793
H  3.050086 3.487245 0.836091
H  2.200127 2.216297 1.70082
H  4.933834 1.342597 -1.56945
H  4.818821 2.933899 -0.838022
H  5.530294 1.602517 0.067552
H  4.164449 -0.613591 -1.666427
H  4.392762 -1.335945 -0.075001
H  2.990621 -1.764724 -1.0495
H  1.302853 -1.143547 0.642796
H  2.675626 -0.941961 1.716119
H  1.459757 0.314534 1.612643
H  -1.124695 3.267595 -0.476315
H  -0.736206 -0.357105 0.163217
H  -3.44546 2.771916 -0.951808
H  -5.099527 1.071701 -1.659735
H  -4.572851 -1.331561 -1.47914
H  -0.31435 -3.494868 -1.661733
H  -2.12482 -2.254482 2.018456
H  1.562808 -4.49574 -0.39871
H  -0.240514 -3.234383 3.273888
H  1.605547 -4.363923 2.072807
elementType: O N C H
totalener: -1132.68131452 hartree
nucrepener: 2355.96051136 hartree
electener: -3488.64182588 hartree
oneelecener: -6220.54780185 hartree
twoeener: 2731.90597597 hartree
cpcmener: -0.03548410 hartree
kineticenergy: 1127.66147488 hartree
xcener: -110.665431432694 hartree
chargesum: -0.0000000
charge: -0.275150 -0.478190 -0.335305 -0.099443 0.106501 0.159379 -0.136239 -0.290697 -0.290409 -0.300705 -0.293062 0.401872 0.356383 -0.014089 -0.222454 -0.143863 -0.218756 0.271025 -0.107798 -0.245138 0.248307 -0.169295 -0.170103 -0.173551 -0.154112 -0.155303 0.085790 0.097876 0.103496 0.089724 0.092219 0.096608 0.099419 0.097161 0.099790 0.092398 0.022887 0.117219 0.105730 0.150356 0.132204 0.147601 0.161451 0.149072 0.149753 0.156637 0.160327 0.161575 0.160903
qa: -0.2751 -0.4782 -0.3353 -0.0994 0.1065 0.1594 -0.1362 -0.2907 -0.2904 -0.3007 -0.2931 0.4019 0.3564 -0.0141 -0.2225 -0.1439 -0.2188 0.2710 -0.1078 -0.2451 0.2483 -0.1693 -0.1701 -0.1736 -0.1541 -0.1553 0.0858 0.0979 0.1035 0.0897 0.0922 0.0966 0.0994 0.0972 0.0998 0.0924 0.0229 0.1172 0.1057 0.1504 0.1322 0.1476 0.1615 0.1491 0.1498 0.1566 0.1603 0.1616 0.1609
va: 2.1125 2.0229 2.0814 3.1078 3.7153 3.5974 3.9229 3.9116 3.9120 3.9218 3.8983 4.1138 3.7581 3.6846 4.0664 3.8946 3.9759 3.7439 3.8936 3.9851 3.7076 3.9237 3.9129 3.8543 3.8510 3.8183 1.0305 0.9985 0.9998 1.0086 1.0063 1.0015 0.9987 1.0065 0.9988 1.0031 1.0221 0.9992 1.0135 1.0156 1.0046 1.0003 0.9874 1.0072 1.0027 0.9967 0.9904 0.9892 0.9899
dispcorr: -0.028967456 hartree
energy: -1132.710281978772
dipole: 27.80445 -26.33227 1.47218 -2.60150 1.73561 -0.86589 1.80732 -2.04730 -0.23998
magnitude: 1.72472 au
magnitude: 4.38390 debye
