program: Orca
programVersion: 5.0.2
elementType: O O O N C C C C C C C C C C C C C C C C C C C C C C H H H H H H H H H H H H H H H H H H H H H H H
charge: 0
multiplicity: 1
keywords: wb97x-d3
keywords: def2-TZVPP
keywords: def2/J RIJCOSX
keywords: DEFGRID2
keywords: scfconv7
keywords: smallprint printgap noloewdin
keywords: NOSOSCF
formula: C22H23NO3
InChI: InChI=1/C22H23NO3/c1-21(2)19(22(21,3)4)20(24)26-18(14-23)15-9-8-12-17(13-15)25-16-10-6-5-7-11-16/h5-13,18-19H,1-4H3
49 atoms
O  0.472807 2.187289 0.931855
O  1.803672 0.627151 0.062721
O  -2.245514 -2.769528 -1.072673
N  0.595391 -0.485245 3.024946
C  3.855293 2.951207 -0.415874
C  2.936218 3.085711 -1.58551
C  2.348235 2.966343 -0.174603
C  4.668179 1.695627 -0.19692
C  4.600631 4.165838 0.095786
C  2.747997 4.430106 -2.253272
C  2.768975 1.961632 -2.580978
C  1.57749 1.797555 0.249845
C  -0.449179 1.177775 1.295344
C  -1.100494 0.506424 0.10257
C  0.158922 0.22856 2.235545
C  -1.336226 -0.859593 0.0837
C  -1.513173 1.303057 -0.9611
C  -2.007834 -1.424047 -0.994513
C  -2.151808 0.718584 -2.043207
C  -2.412286 -0.643512 -2.065618
C  -2.567916 -3.469823 0.066495
C  -1.997758 -4.724104 0.224238
C  -3.469721 -2.974873 1.000481
C  -2.332753 -5.489928 1.332759
C  -3.785121 -3.746226 2.109542
C  -3.219896 -5.003117 2.282516
H  1.961003 3.89684 0.224973
H  4.243846 0.792284 -0.623587
H  5.656947 1.831144 -0.64131
H  4.815238 1.520173 0.870673
H  5.485773 4.354548 -0.515136
H  4.000552 5.07351 0.102569
H  4.939269 3.994204 1.119253
H  2.732956 5.264043 -1.554741
H  3.548233 4.611549 -2.973875
H  1.803856 4.448845 -2.80055
H  2.926972 0.965445 -2.178735
H  1.766791 1.987208 -3.013751
H  3.479993 2.097695 -3.398879
H  -1.22005 1.707121 1.862171
H  -1.002724 -1.490067 0.89888
H  -1.342654 2.371499 -0.954643
H  -2.46755 1.333995 -2.87493
H  -2.924434 -1.095613 -2.905065
H  -1.300391 -5.098533 -0.514404
H  -3.925338 -2.00118 0.871019
H  -1.887644 -6.468681 1.455225
H  -4.484243 -3.360106 2.839692
H  -3.471875 -5.598912 3.149584
elementType: O N C H
totalener: -1132.68314448 hartree
nucrepener: 2242.83245785 hartree
electener: -3375.51560233 hartree
oneelecener: -5995.57076040 hartree
twoeener: 2620.05515807 hartree
cpcmener: -0.03715349 hartree
kineticenergy: 1127.64528335 hartree
xcener: -110.661531887278 hartree
chargesum: -0.0000000
charge: -0.303644 -0.471823 -0.339556 -0.093724 0.103899 0.092808 -0.088331 -0.303947 -0.283482 -0.282845 -0.297546 0.381546 0.542237 -0.042108 -0.259835 -0.184710 -0.287174 0.279511 -0.103374 -0.243575 0.276054 -0.246742 -0.184355 -0.126858 -0.148084 -0.186181 0.087698 0.097175 0.098837 0.102537 0.099912 0.093151 0.095694 0.092438 0.100675 0.096055 0.098305 0.097742 0.103083 0.149130 0.136565 0.147444 0.162312 0.149374 0.149219 0.159003 0.161276 0.162650 0.161565
qa: -0.3036 -0.4718 -0.3396 -0.0937 0.1039 0.0928 -0.0883 -0.3039 -0.2835 -0.2828 -0.2975 0.3815 0.5422 -0.0421 -0.2598 -0.1847 -0.2872 0.2795 -0.1034 -0.2436 0.2761 -0.2467 -0.1844 -0.1269 -0.1481 -0.1862 0.0877 0.0972 0.0988 0.1025 0.0999 0.0932 0.0957 0.0924 0.1007 0.0961 0.0983 0.0977 0.1031 0.1491 0.1366 0.1474 0.1623 0.1494 0.1492 0.1590 0.1613 0.1626 0.1616
va: 2.1216 2.0257 2.0663 3.1032 3.7169 3.7160 3.9123 3.9066 3.9049 3.9032 3.9086 4.0742 3.7713 3.7215 4.1201 3.9046 3.9896 3.7575 3.8832 4.0222 3.6898 4.0033 3.8975 3.8781 3.8869 3.8966 1.0334 1.0119 0.9984 0.9988 0.9987 1.0054 1.0022 1.0054 0.9987 1.0023 1.0119 1.0009 0.9988 0.9869 1.0177 1.0110 0.9879 1.0051 1.0067 0.9955 0.9881 0.9890 0.9892
dispcorr: -0.024549461 hartree
energy: -1132.707693939067
dipole: 21.88697 -22.63882 -0.75185 19.88695 -17.46607 2.42088 -11.01973 9.95358 -1.06615
magnitude: 2.75002 au
magnitude: 6.99000 debye
